{"text_format":"1","workbook":"xlsx","n_sheets":15,"sheets":["Instructions","Data Input","Calculations","Results","DataCollectionNeeds","Pick Lists","Country Parameters","Wind Capacity Factor","Conversions","Fuel EFs","LineLoss","Grid EFs","Assumptions","Diesel Efficiency Estimator","PlotData"],"not_rendered":{"charts":1,"images":2,"macros":1,"external_links":1,"defined_names":87,"comments":2,"pivot_tables":0},"unopened":[],"bounds":{"document_bytes":16777216,"sheet_cells":100000,"rows_first":2000,"rows_last":500,"rows_between":2000,"halvings":0,"cell_chars":16384,"cell_head_chars":4096},"cells_cut":0,"cells_raw":0,"read":"whole","date_system":"1900"}

{"sheet":"Instructions","index":0,"n_rows":36,"n_cols":4,"rows_kept":36,"cut":false,"hidden":false,"merged":[[6,1,6,2],[1,1,1,3],[2,1,2,2],[3,1,3,2],[5,1,5,2],[4,1,4,2]]}
[" "]
[null,"USAID Clean Energy Emission Reduction (CLEER) \nRegularization of Unauthorized Electricity Connections"]
[null,"Purpose:",null,"This tool assists USAID operating units in estimating GHG emission reductions associated with the reduction\nof non-technical electricity losses from regularization."]
[null,"Version Number:",null,"Version 2.8"]
[null,"Version Date:",null,"2023-10-01"]
[null,"Activity Type:",null,"Increase Energy System Efficiency - Regularization of Unauthorized Electricity Connections"]
[]
[]
[null,"Instructions:"]
[null,"If your clean energy activity involves multiple actions, each action may have to be estimated separately using this calculator. "]
{"$rows_left_out":27}
{"sheet":"Data Input","index":1,"n_rows":56,"n_cols":13,"rows_kept":56,"cut":false,"hidden":false,"merged":[[45,12,46,17],[41,12,42,17],[54,2,59,10],[3,1,4,9],[37,3,37,5],[45,3,45,5],[47,3,47,5],[43,3,43,5],[39,3,39,5],[41,3,41,5],[20,7,24,9],[38,9,41,9]]}
[]
[null,"Action Information and Data Input"]
[]
[null,"Use this form to enter information about the action and its energy use."]
[]
[]
[]
[]
[null,"Section 1 - Action Information"]
[null,"*required fields"]
{"$rows_left_out":47}
{"sheet":"Calculations","index":2,"n_rows":65,"n_cols":14,"rows_kept":65,"cut":false,"hidden":false,"merged":[[53,11,53,13],[54,11,54,13],[33,5,33,7],[34,5,34,7],[47,5,47,7],[54,5,54,7],[52,5,52,7],[53,5,53,7],[45,5,45,7],[43,5,43,7],[44,5,44,7],[3,1,4,11],[5,1,6,11],[12,3,12,7],[14,3,14,7],[66,2,71,12],[20,3,20,7],[22,3,22,7],[16,3,16,7],[18,3,18,7],[45,11,45,13],[44,11,44,13],[49,5,49,7],[58,5,58,7],[56,5,56,7],[35,5,35,7],[31,5,31,7]]}
[]
[null,"Calculations"]
[]
[null,"Review the emission reduction calculations. Enter alternate values in the blue fields, if desired."]
[]
[]
[]
[]
[null,"Summary of Data Input"]
[null,"This section summarizes data input in the Energy Information and Data section."]
{"$rows_left_out":56}
{"sheet":"Results","index":3,"n_rows":36,"n_cols":8,"rows_kept":36,"cut":false,"hidden":false,"merged":[[35,2,40,11]]}
[]
[null,"Results"]
[]
[]
[null,"This page summarizes total FY emissions reduced or avoided (tCO2e). Report Total FY Emission Reductions in the green field for Indicator 4.8-7."]
[]
[null,"Results and Summary"]
[]
[null,"Action Information Summary"]
[null,null,"Implementing Mechanism Number",null,null,{"$f":"IF('Data Input'!F14=\"\",\"\",'Data Input'!F14)","v":""}]
{"$rows_left_out":27}
{"sheet":"DataCollectionNeeds","index":4,"n_rows":77,"n_cols":5,"rows_kept":77,"cut":false,"hidden":false,"merged":[[8,1,8,4],[72,1,73,1],[72,2,73,2],[72,3,73,3],[72,4,73,4],[70,4,71,4],[70,3,71,3],[70,2,71,2],[70,1,71,1],[74,2,75,2],[74,4,75,4],[74,3,75,3],[76,1,77,1],[76,3,77,3],[76,4,77,4],[76,2,77,2],[74,1,75,1]]}
[]
[null,"Data Collection Needs"]
[]
[]
[null,"This page lists the necessary data the user should collect for estimating GHG emission reductions, which will vary by action."]
[]
[]
[null,"Regularization of Unauthorized Electricity Connections: Calculator Pathways"]
[null,"Instructions: This calculator is capable of estimating emissions using different sets of inputs. Follow the diagram below to understand how sets of inputs are grouped together to complete the calculations. The diagram will also be helpful in determining information you may need to collect in the future. \nThe diagram is color-coded to differentiate the type of input. Highlighted data inputs are further explained in the table below the diagram. Blue shapes are questions asked in the calculator, which determine the set of inputs necessary. Grey shapes indicate a user-selected answer which are chosen from a drop down menu. Yellow shapes indicate a user-input that is manually entered. Green shapes indicate the option of entering an alternative value for a specific input. "]
[]
{"$rows_left_out":68}
{"sheet":"Pick Lists","index":5,"n_rows":224,"n_cols":5,"rows_kept":224,"cut":false,"hidden":true,"merged":[]}
[]
[]
[null,"Pick Lists"]
[null,"Status List"]
[null,"Draft"]
[null,"In Review"]
[null,"Edits Required"]
[null,"Completed"]
[]
[null,"Grid Electricity"]
{"$rows_left_out":215}
{"sheet":"Country Parameters","index":6,"n_rows":233,"n_cols":21,"rows_kept":233,"cut":false,"hidden":true,"merged":[]}
[null,1,2,3,4,5,6,7,8,9,10,11,12,13,null,null,14,15,16]
[null,"Country Parameters"]
[null,"Short-form name","Long-form name","US FIPS","Alpha-2","Alpha-3","Numeric Code","Latitude Average","Longitude Average","Region","Grid Average Utilized (Grams CO2/kWh)","Grams CO2/kWh\n(Coal/Peat)","Grams CO2/kWh\n(Oil)","Grams CO2/kWh\n(Natural Gas)","Grid Average (IEA) (Grams CO2/kWh)","CDM Avearge Combined Marginal (IGES)","Average Solar Insolation (kWh/m^2/day) and Average-Day Insolation (hr)","Average Grid Line Loss Rate (%)","Regional Emission Factor utilized","Wind  Capacity Factor","Regional Capacity Factor Utilized"]
[null,"Afghanistan","Islamic Republic of Afghanistan","AF","AF","AFG",4,33,65,"Asia",{"$f":"IF(P4=\"N/A\",O4,P4)","v":846.53392083466008},919.05070000000001,785.51969999999994,527.41980000000001,451.13060000000002,846.53392083466008,5.3,5.7300046286854894E-2,{"$f":"IF(ISNUMBER(MATCH(B4,'Grid EFs'!$B$4:$B$157,0)),\"\",\"*\")","v":""},{"$f":"VLOOKUP(B4,'Wind Capacity Factor'!$B$6:$L$276,8,FALSE)","v":0.18500946185704334},{"$f":"IF(INDEX('Wind Capacity Factor'!$A$6:$B$258,MATCH('Country Parameters'!B4,'Wind Capacity Factor'!$B$6:$B$258,0),1)=\"*\",\"*\",\"\")","v":"*"}]
[null,"Albania","Republic of Albania","AL","AL","ALB",8,41,20,"Europe",{"$f":"IF(P5=\"N/A\",O5,P5)","v":312.0333333333333},919.05070000000001,785.51969999999994,527.41980000000001,6.9824000000000002,312.0333333333333,4.1399999999999997,0.10120170181363654,{"$f":"IF(ISNUMBER(MATCH(B5,'Grid EFs'!$B$4:$B$157,0)),\"\",\"*\")","v":""},{"$f":"VLOOKUP(B5,'Wind Capacity Factor'!$B$6:$L$276,8,FALSE)","v":0.22185234633472933},{"$f":"IF(INDEX('Wind Capacity Factor'!$A$6:$B$258,MATCH('Country Parameters'!B5,'Wind Capacity Factor'!$B$6:$B$258,0),1)=\"*\",\"*\",\"\")","v":"*"}]
[null,"Algeria","People's Democratic Republic of Algeria","AG","DZ","DZA",12,28,3,"Africa",720.02358500000003,974.53949999999998,935.38210000000004,528.50840000000005,549.20079999999996,720.02358500000003,5.61,9.4921608188063056E-2,{"$f":"IF(ISNUMBER(MATCH(B6,'Grid EFs'!$B$4:$B$157,0)),\"\",\"*\")","v":""},{"$f":"VLOOKUP(B6,'Wind Capacity Factor'!$B$6:$L$276,8,FALSE)","v":0.24610688499118938},{"$f":"IF(INDEX('Wind Capacity Factor'!$A$6:$B$258,MATCH('Country Parameters'!B6,'Wind Capacity Factor'!$B$6:$B$258,0),1)=\"*\",\"*\",\"\")","v":"*"}]
[null,"Andorra","Principality of Andorra","AN","AD","AND",20,42.5,1.6,"Europe",331.06400000000002,917.48320000000001,690.57929999999999,359.07440000000003,331.06400000000002,"N/A",3.7,5.8109323007447068E-2,{"$f":"IF(ISNUMBER(MATCH(B7,'Grid EFs'!$B$4:$B$157,0)),\"\",\"*\")","v":""},{"$f":"VLOOKUP(B7,'Wind Capacity Factor'!$B$6:$L$276,8,FALSE)","v":0.22185234633472933},{"$f":"IF(INDEX('Wind Capacity Factor'!$A$6:$B$258,MATCH('Country Parameters'!B7,'Wind Capacity Factor'!$B$6:$B$258,0),1)=\"*\",\"*\",\"\")","v":"*"}]
[null,"Angola","Republic of Angola","AO","AO","AGO",24,-12.5,18.5,"Africa",840.8,974.53949999999998,1343.4219000000001,456.774,390.84410000000003,840.8,5.58,7.4274443578152466E-2,{"$f":"IF(ISNUMBER(MATCH(B8,'Grid EFs'!$B$4:$B$157,0)),\"\",\"*\")","v":""},{"$f":"VLOOKUP(B8,'Wind Capacity Factor'!$B$6:$L$276,8,FALSE)","v":0.24610688499118938},{"$f":"IF(INDEX('Wind Capacity Factor'!$A$6:$B$258,MATCH('Country Parameters'!B8,'Wind Capacity Factor'!$B$6:$B$258,0),1)=\"*\",\"*\",\"\")","v":"*"}]
[null,"Antigua and Barbuda","Antigua and Barbuda","AC","AG","ATG",28,17.05,-61.8,"North America",472.44098150782378,1240.4880000000001,671.35590000000002,502.83659999999998,200.8047,472.44098150782378,6.16,5.7679364750868239E-2,{"$f":"IF(ISNUMBER(MATCH(B9,'Grid EFs'!$B$4:$B$157,0)),\"\",\"*\")","v":"*"},{"$f":"VLOOKUP(B9,'Wind Capacity Factor'!$B$6:$L$276,8,FALSE)","v":0.23637861684516193},{"$f":"IF(INDEX('Wind Capacity Factor'!$A$6:$B$258,MATCH('Country Parameters'!B9,'Wind Capacity Factor'!$B$6:$B$258,0),1)=\"*\",\"*\",\"\")","v":"*"}]
[null,"Argentina","Argentine Republic","AR","AR","ARG",32,-34,-64,"South America",504.72114285714298,1165.1775,731.76139999999998,476.05540000000002,397.17439999999999,504.72114285714298,4.8,8.483952739530716E-2,{"$f":"IF(ISNUMBER(MATCH(B10,'Grid EFs'!$B$4:$B$157,0)),\"\",\"*\")","v":"*"},{"$f":"VLOOKUP(B10,'Wind Capacity Factor'!$B$6:$L$276,8,FALSE)","v":0.29895874855381749},{"$f":"IF(INDEX('Wind Capacity Factor'!$A$6:$B$258,MATCH('Country Parameters'!B10,'Wind Capacity Factor'!$B$6:$B$258,0),1)=\"*\",\"*\",\"\")","v":""}]
{"$rows_left_out":224}
{"sheet":"Wind Capacity Factor","index":7,"n_rows":262,"n_cols":15,"rows_kept":262,"cut":false,"hidden":true,"merged":[[1,1,2,11]]}
[]
[null,"Wind Electricity Capacity Factor (%)"]
[]
[]
[null,null,null,2007,2008,2009,2010,2011,2012,"Average","Weighted Average",null,null,null,"Used Regional Values for Missing Data"]
[null,"North America",null,0.23339787536287881,0.25005650682613756,0.24335883990757234,0.27563614479861548,0.31282940899159939,0.26615710811772753,0.26357264733408847,0.26986701930910972,-2.3880975657701281E-2,null,null,"Regional Average"]
[{"$f":"IF(I7=$I$6,\"*\",\"\")","v":"*"},"Bermuda",null,"","","","","",0.26615710811772753,0.26357264733408847,"",""]
["","Canada",null,0.18761167361524717,0.18110417839494591,0.2309887333427941,0.27501430177963637,0.42685174344230664,0.20824127264692882,0.25163531720364318,0.26893062113622629,-6.8731623703624956E-2]
["*","Greenland",null,"","","","","",0.26615710811772753,0.26357264733408847,"",""]
["","Mexico",null,0.296125502961255,0.30403725304037249,0.14323479932708486,0.248573560921588,0.26269003715269074,0.27064524083267233,0.25421773237261053,0.24939414057018261,1.89742539098646E-2]
{"$rows_left_out":253}
{"sheet":"Conversions","index":8,"n_rows":142,"n_cols":14,"rows_kept":142,"cut":false,"hidden":true,"merged":[]}
[]
[null,null,"IPCC SAR GWPs",null,null,null,"Additional Refrigerant GWPs",null,null,null,"IPCC AR4 GWPs"]
[null,null,"Gas","GWP",null,null,"Gas","GWP","Chemical Formula",null,"Gas","GWP"]
[null,null,"CO2",1,null,null,"HFC-41",150,"CH3F",null,"CO2",1]
[null,null,"CH4",21,null,null,"HFC-134",1000,"CHF2CHF2",null,"CH4",25]
[null,null,"N2O",310,null,null,"HFC-143",300,"CHF2CH2F",null,"N2O",298]
[null,null,"HFC-23",11700,null,null,"HFC-152",53,"CH2FCH2F",null,"HFC-23",14800]
[null,null,"HFC-32",650,null,null,"HFC-161",12,"CH3CH2F",null,"HFC-32",675]
[null,null,"HFC-125",2800,null,null,"HFC-236cb",1340,"CH2FCF2CF3",null,"HFC-125",3500]
[null,null,"HFC-134a",1300,null,null,"HFC-236ea",1370,"CHF2CHFCF3",null,"HFC-134a",1430]
{"$rows_left_out":133}
{"sheet":"Fuel EFs","index":9,"n_rows":71,"n_cols":24,"rows_kept":71,"cut":false,"hidden":true,"merged":[[2,15,4,15],[2,16,3,23]]}
[null,1,2,3,4,5,6,7,8,9,10,11,12,13,14,15,16,17,18,19,20,21,22,22]
[null,"Default Emission Factors for Stationary Combustion in the Energy Industries"]
[null,null,null,"g of GHG per GJ on a Net Calorific Basis",null,null,null,null,null,null,null,null,null,null,null,"Density (kg/L)","Heating Values & Conversions (GJ/unit)"]
[null,null,null,"CO2",null,null,"CH4",null,null,null,"N2O",null,null,"CO2E"]
[null,"USAID CLEER Tool Name","IPCC Name","Default Emission Factor","Lower","Upper","Default Emission Factor","Lower","Upper","Default Emission Factor","Lower","Upper","Default Emission Factor","Lower","Upper",null,"Tonnes (t)","Gallons (gal)","Liter (L)","Pounds (lbs.)","Kilograms (kg)","Million BTUs (MMBTU)","Therms","100 Cubic Feet"]
[null,null,"(intentional blank row)",null,null,null,null,null,null,null,null,null,null,null,null,null,"(GJ/t)","(GJ/gal)","(GJ/L)","(GJ/lbs)","(GJ/kg)","(GJ/MMBTU)","(GJ/Therm)","(GJ/Ccf)"]
[48,"Biofuel - Biodiesels","Biodiesels",70800,59800,84300,3,1,10,0.6,0.2,2,{"$f":"D7*Conversions!$L$4+'Fuel EFs'!G7*Conversions!$L$5+'Fuel EFs'!J7*Conversions!$L$6","v":71053.8},{"$f":"E7*Conversions!$L$4+'Fuel EFs'!H7*Conversions!$L$5+'Fuel EFs'!K7*Conversions!$L$6","v":59884.6},{"$f":"F7*Conversions!$L$4+'Fuel EFs'!I7*Conversions!$L$5+'Fuel EFs'!L7*Conversions!$L$6","v":85146},null,27,null,null,{"$f":"U7*Conversions!$E$84","v":1.224699399E-2},{"$f":"Q7*Conversions!$F$80","v":2.7E-2},{"$f":"Conversions!$K$58","v":1.055056},{"$f":"Conversions!$K$59","v":0.105506}]
[47,"Biofuel - Biogasoline","Biogasoline",70800,59800,84300,3,1,10,0.6,0.2,2,{"$f":"D8*Conversions!$L$4+'Fuel EFs'!G8*Conversions!$L$5+'Fuel EFs'!J8*Conversions!$L$6","v":71053.8},{"$f":"E8*Conversions!$L$4+'Fuel EFs'!H8*Conversions!$L$5+'Fuel EFs'!K8*Conversions!$L$6","v":59884.6},{"$f":"F8*Conversions!$L$4+'Fuel EFs'!I8*Conversions!$L$5+'Fuel EFs'!L8*Conversions!$L$6","v":85146},null,27,null,null,{"$f":"U8*Conversions!$E$84","v":1.224699399E-2},{"$f":"Q8*Conversions!$F$80","v":2.7E-2},{"$f":"Conversions!$K$58","v":1.055056},{"$f":"Conversions!$K$59","v":0.105506}]
[49,"Biofuel - Other Liquid Biofuels","Other Liquid Biofuels",79600,67100,95300,3,1,10,0.6,0.2,2,{"$f":"D9*Conversions!$L$4+'Fuel EFs'!G9*Conversions!$L$5+'Fuel EFs'!J9*Conversions!$L$6","v":79853.8},{"$f":"E9*Conversions!$L$4+'Fuel EFs'!H9*Conversions!$L$5+'Fuel EFs'!K9*Conversions!$L$6","v":67184.600000000006},{"$f":"F9*Conversions!$L$4+'Fuel EFs'!I9*Conversions!$L$5+'Fuel EFs'!L9*Conversions!$L$6","v":96146},null,27.4,null,null,{"$f":"U9*Conversions!$E$84","v":1.2428430938000001E-2},{"$f":"Q9*Conversions!$F$80","v":2.7400000000000001E-2},{"$f":"Conversions!$K$58","v":1.055056},{"$f":"Conversions!$K$59","v":0.105506}]
[50,"Biogas - Landfill Gas","Landfill Gas",54600,46200,66000,1,0.3,3,0.1,0.03,0.3,{"$f":"D10*Conversions!$L$4+'Fuel EFs'!G10*Conversions!$L$5+'Fuel EFs'!J10*Conversions!$L$6","v":54654.8},{"$f":"E10*Conversions!$L$4+'Fuel EFs'!H10*Conversions!$L$5+'Fuel EFs'!K10*Conversions!$L$6","v":46216.44},{"$f":"F10*Conversions!$L$4+'Fuel EFs'!I10*Conversions!$L$5+'Fuel EFs'!L10*Conversions!$L$6","v":66164.399999999994},null,50.4,null,null,{"$f":"U10*Conversions!$E$84","v":2.2861055448E-2},{"$f":"Q10*Conversions!$F$80","v":5.04E-2},{"$f":"Conversions!$K$58","v":1.055056},{"$f":"Conversions!$K$59","v":0.105506}]
{"$rows_left_out":62}
{"sheet":"LineLoss","index":10,"n_rows":209,"n_cols":6,"rows_kept":209,"cut":false,"hidden":true,"merged":[[201,1,206,2]]}
[]
[null,"IEA Electricity Information  - Lineloss",null,null,"Regional Averages"]
["IEA Names","Region/Country/Economy","Grid Average Lineloss",null,"Region","Grid Average Lineloss"]
["Afghanistan","Afghanistan",5.7300046286854894E-2,null,"Africa",7.571494692664206E-2]
["Albania","Albania",0.10120170181363654,null,"Asia",5.7300046286854894E-2]
["Algeria","Algeria",9.4921608188063056E-2,null,"Europe",5.8109323007447068E-2]
["Andorra","Andorra",5.8109323007447068E-2,null,"North America",5.7679364750868239E-2]
["Angola","Angola",7.4274443578152466E-2,null,"Oceania",5.2001785658027835E-2]
["Antigua and Barbuda","Antigua and Barbuda",5.7679364750868239E-2,null,"South America",8.3808354719636283E-2]
["Argentina","Argentina",8.483952739530716E-2]
{"$rows_left_out":200}
{"sheet":"Grid EFs","index":11,"n_rows":223,"n_cols":14,"rows_kept":223,"cut":false,"hidden":true,"merged":[[2,8,2,11],[2,12,2,13],[220,1,220,5],[222,1,224,5]]}
[]
[null,"IEA CO2 From Fossil Fuel  - Grams CO2/kWh (2012)",null,null,null,null,null,"Regional Averages"]
["IEA Names","Region/Country/Economy","Grid Average","Coal/Peat","Oil","Natural Gas",null,null,"IEA",null,null,null,"IGES"]
["Canada","Canada",150.88890000000001,900.98339999999996,882.01819999999998,475.46699999999998,null,"Region","Average of Grams CO2","Coal/Peat","Oil","Natural Gas","Region","CDM CM (IGES)"]
["Chile","Chile",599.67925000000048,868.79169999999999,984.12059999999997,438.09780000000001,null,"Africa",597.66229999999996,974.53949999999998,833.97270000000003,456.774,"Africa",713.78507792207802]
["Mexico","Mexico",529.39173553718979,963.50099999999998,696.73030000000006,406.79509999999999,null,"Asia",736.13379999999995,1144.2709,843.06479999999999,451.97480000000002,"Asia",852.140056482962]
["United States","United States",480.68610000000001,912.45330000000001,671.13300000000004,403.06540000000001,null,"Europe",331.06400000000002,917.48320000000001,690.57929999999999,359.07440000000003,"Europe and Eurasia","N/A"]
[null,"OECD Americas",440.16149638429761,911.43235000000004,808.50052499999993,430.85632499999997]
[null,"Australia",798.90189999999996,993.75379999999996,679.18949999999995,522.1739,null,"North America",439.49040000000002,912.40520000000004,718.42819999999995,407.01139999999998,"North America","N/A"]
["Australia","Israel",705.11789473684212,851.55619999999999,869.50779999999997,364.53910000000002,null,"Oceania",578.45060000000001,931.32029999999997,633.54280000000006,439.2518,"Pacific Islands","N/A"]
{"$rows_left_out":214}
{"sheet":"Assumptions","index":12,"n_rows":9,"n_cols":3,"rows_kept":9,"cut":false,"hidden":true,"merged":[]}
[]
[null,"Decisions and assumptions made for the development of the Solar PV Worksheet"]
[null,"Date","Assumption"]
[null,"2012-12-07"," For countries that did not have specific IEA grid emission factors or line loss values, regional averages were used as a proxy"]
[null,"2012-12-07","Project emissions for solar projects are 0. Activity generation is assumed equal to the baseline consumption."]
[null,"2012-12-18","Average Daily Insolation (HS) in hours equals annual average insolation in kWh/m2/day"]
[null,"2012-12-18","Assumes default array tilt angle is equal to the latitude angle of the location."]
[null,"2012-12-28","For countries without country-specific grid emission factors, the \"Other Countries\" category within the region was used instead. If the \"Other Countries\" category was not available, the regional average was use."]
[null,"2012-12-29","Fuel Emission Factors assume a net calorific basis of combustion "]

{"sheet":"Diesel Efficiency Estimator","index":13,"n_rows":39,"n_cols":13,"rows_kept":39,"cut":false,"hidden":true,"merged":[]}
[]
[]
[null,null,"http://www.dieselserviceandsupply.com/Diesel_Fuel_Consumption.aspx",null,null,null,null,null," Efficiencies for Individual mode of operation"]
[null,null,null,null,null,null,null,null,0.25,0.5,0.75,1]
[null,null,"Generator Size (kW)","1/4 Load (gal/hr)","1/2 Load (gal/hr)","3/4 Load (gal/hr)","Full Load (gal/hr)",null,"1/4 Load (gal/hr)","1/2 Load (gal/hr)","3/4 Load (gal/hr)","Full Load (gal/hr)"]
[null,null,20,0.6,0.9,1.3,1.6,null,{"$f":"1/(D6/$C6/I$4*$D$35/$D$37)","v":0.2194119910998211},0.29254932146642815,0.30380121844590613,0.32911798664973169]
[null,null,30,1.3,1.8,2.4,2.9,null,0.15190060922295306,0.2194119910998211,0.24683848998729874,0.27237350619288136]
[null,null,40,1.6,2.2999999999999998,3.2,4,null,0.16455899332486584,0.22895164288676992,0.24683848998729874,0.26329438931978533]
[null,null,60,1.8,2.9,3.8,4.8,null,0.2194119910998211,0.27237350619288136,0.3117959873523774,0.32911798664973169]
[null,null,75,2.4,3.4,4.5999999999999996,6.1,null,0.20569874165608229,0.29039822351446914,0.32196324780952018,0.3237226098194082]
{"$rows_left_out":30}
{"sheet":"PlotData","index":14,"n_rows":10,"n_cols":5,"rows_kept":10,"cut":false,"hidden":true,"merged":[]}
[]
[null,"For Bar Plot"]
[null,"Baseline Emissions",null,null,{"$f":"IF(Results!D23=\"\",0,Results!D23)","v":0}]
[null,"Activity Emissions",null,null,{"$f":"IF(Results!F23=\"\",0,Results!F23)","v":0}]
[null,"Emission Reductions",null,null,{"$f":"IF(Results!H23=\"\",0,Results!H23)","v":0}]
[]
[null,"For Line Plot"]
[null,"Coordinates","Action","Baseline"]
[null,0.75,{"$f":"E4+E5/100","v":0},{"$f":"E3+E5/100","v":0}]
[null,1.25,{"$f":"E4+E5/100","v":0},{"$f":"E3+E5/100","v":0}]