{"text_format":"1","workbook":"xlsx","n_sheets":17,"sheets":["Instructions","Data Input","Calculations","Results","DataCollectionNeeds","Data","CDD-energy curve fit","WeatherData","Dropdowns","Lifetime&PlotData","Country Pick","Country Parameters","Fuel EFs","Grid EFs","LineLoss","Conversions","Pick Lists"],"not_rendered":{"charts":5,"images":5,"macros":1,"external_links":1,"defined_names":144,"comments":3,"pivot_tables":0},"unopened":[],"bounds":{"document_bytes":16777216,"sheet_cells":100000,"rows_first":2000,"rows_last":500,"rows_between":2000,"halvings":0,"cell_chars":16384,"cell_head_chars":4096},"cells_cut":0,"cells_raw":0,"read":"whole","date_system":"1900"}

{"sheet":"Instructions","index":0,"n_rows":36,"n_cols":4,"rows_kept":36,"cut":false,"hidden":false,"merged":[[6,1,6,2],[1,1,1,3],[2,1,2,2],[3,1,3,2],[4,1,4,2],[5,1,5,2]]}
[]
[null,"USAID Clean Energy Emission Reduction (CLEER) \nBuilding Energy Efficiency Improvement or Replacement"]
[null,"Purpose:",null,"This tool assists USAID operating units in estimating GHG emissions reduced or avoided \nfrom building efficiency measures."]
[null,"Version Number:",null,"Version 2.8"]
[null,"Version Date:",null,"2023-10-01"]
[null,"Activity Type:",null,"Increase End-Use Energy Efficiency: Building Energy Efficiency Improvement or Replacement"]
[]
[]
[null,"Instructions:"]
[null,"If your building efficiency measures involve multiple actions, each action may have to be estimated separately using this calculator. "]
[null,"Note: Please enable macros before beginning."]
[]
[null,"Step 1: Enter program information in the \"Action Information\" section of the \"Data Input\" page."]
[]
[null,"Step 2: Enter the energy efficiency data on the \"Energy Information and Data\" section of the \"Data Input\" page."]
[]
[null,"Step 3: List any assumptions on the data from the action at the bottom of the \"Data Input\" page."]
[]
[null,"Step 4: Click on the \"Review Calculations\" arrow to proceed to the \"Calculations\" page."]
[]
[null,"Step 5: Review calculations and enter alternate values if desired."]
[]
[null,"Step 6: List any assumptions made about the alternate values at the bottom of the \"Calculations\" page."]
[]
[null,"Step 7: Click on the \"View Results\" arrow to review the final calculation of annual emission reductions."]
[]
[null,"Step 8: Report emission reductions to the Global Climate Change Office through the FACTS Info database."]
[]
[null,"Note: Data from multiple actions will have to be aggregated in order to report on an entire activity. "]
[]
[null,"Legend:"]
[null,null,"Cell Color Legend:"]
[null,null,null,"Yellow cells are Input Fields."]
[null,null,null,"Blue cells are input fields for Alternate Values."]
[null,null,null,"Green cells are GHG Estimates."]
[null,null,null,"White cells are calculations fields and are not editable."]

{"sheet":"Data Input","index":1,"n_rows":57,"n_cols":14,"rows_kept":57,"cut":false,"hidden":false,"merged":[[3,1,4,9],[58,2,63,10],[20,7,24,9]]}
[]
[null,"Action Information and Data Input"]
[]
[null,"Use this form to enter information about the action and its energy use."]
[]
[]
[]
[]
[null,"Section 1 - Action Information"]
[null,"*required fields"]
[]
[null,null,null,"About the Action",null,null,null,"Reporting Details and Worksheet Status"]
[]
[null,null,null,"Implementing Mechanism Number*",null,null,null,"Point of Contact (Name)"]
[null,null,null,"Implementing Mechanism Name*",null,null,null,"Contact Email"]
[null,null,null,"Action Name*",null,null,null,"Contact Phone (Including Country Code)"]
[null,null,null,"Fiscal Year Reported*",null,null,null," Worksheet Status"]
[null,null,null,"Operating Unit",null,null,null," Worksheet Date"]
[null,null,null,"Implementing Partner",null,null,null,"Description of the Action"]
[]
[null,null,null,"Location of the Action"]
[null,null,null,"Country*"]
[null,null,null,"Subnational Region, State, or Province"]
[null,null,null,"City"]
[null,null,null,"Geographic Coordinates"]
[]
[]
[]
[]
[]
[]
[]
[null,"Section 2 - Energy Information and Data"]
[null,"*Use the calculator for up to 10 measures at a time. Use a second calculator if you have more than 10 measures."]
[]
[null,null,"Select the measures that have been installed"]
[null,null,null,"Sector",null,"Category",null,"Measure",null,"Enter the Number of  Units",null,"Units",null,"Is the measure weather sensitive?"]
[null,null,1,null,null,null,null,null,null,null,null,{"$f":"IF(D38=\"\",\"\",IFERROR(INDEX(dUnits,MATCH($D38&$F38&$H38,dSector&dCategory&dMeasure,0)),\" - \"))","v":""},null,{"$f":"IF(D38=\"\",\"\",IFERROR(INDEX(dWeatherSensitive,MATCH('Data Input'!$D38&'Data Input'!$F38&'Data Input'!$H38,dSector&dCategory&dMeasure,0)),\" - \"))","v":""}]
[null,null,{"$f":"C38+1","v":2},null,null,null,null,null,null,null,null,{"$f":"IF(D39=\"\",\"\",IFERROR(INDEX(dUnits,MATCH($D39&$F39&$H39,dSector&dCategory&dMeasure,0)),\" - \"))","v":""},null,{"$f":"IF(D39=\"\",\"\",IFERROR(INDEX(dWeatherSensitive,MATCH('Data Input'!$D39&'Data Input'!$F39&'Data Input'!$H39,dSector&dCategory&dMeasure,0)),\" - \"))","v":""}]
[null,null,{"$f":"C39+1","v":3},null,null,null,null,null,null,null,null,{"$f":"IF(D40=\"\",\"\",IFERROR(INDEX(dUnits,MATCH($D40&$F40&$H40,dSector&dCategory&dMeasure,0)),\" - \"))","v":""},null,{"$f":"IF(D40=\"\",\"\",IFERROR(INDEX(dWeatherSensitive,MATCH('Data Input'!$D40&'Data Input'!$F40&'Data Input'!$H40,dSector&dCategory&dMeasure,0)),\" - \"))","v":""}]
[null,null,4,null,null,null,null,null,null,null,null,{"$f":"IF(D41=\"\",\"\",IFERROR(INDEX(dUnits,MATCH($D41&$F41&$H41,dSector&dCategory&dMeasure,0)),\" - \"))","v":""},null,{"$f":"IF(D41=\"\",\"\",IFERROR(INDEX(dWeatherSensitive,MATCH('Data Input'!$D41&'Data Input'!$F41&'Data Input'!$H41,dSector&dCategory&dMeasure,0)),\" - \"))","v":""}]
[null,null,5,null,null,null,null,null,null,null,null,{"$f":"IF(D42=\"\",\"\",IFERROR(INDEX(dUnits,MATCH($D42&$F42&$H42,dSector&dCategory&dMeasure,0)),\" - \"))","v":""},null,{"$f":"IF(D42=\"\",\"\",IFERROR(INDEX(dWeatherSensitive,MATCH('Data Input'!$D42&'Data Input'!$F42&'Data Input'!$H42,dSector&dCategory&dMeasure,0)),\" - \"))","v":""}]
[null,null,{"$f":"C42+1","v":6},null,null,null,null,null,null,null,null,{"$f":"IF(D43=\"\",\"\",IFERROR(INDEX(dUnits,MATCH($D43&$F43&$H43,dSector&dCategory&dMeasure,0)),\" - \"))","v":""},null,{"$f":"IF(D43=\"\",\"\",IFERROR(INDEX(dWeatherSensitive,MATCH('Data Input'!$D43&'Data Input'!$F43&'Data Input'!$H43,dSector&dCategory&dMeasure,0)),\" - \"))","v":""}]
[null,null,7,null,null,null,null,null,null,null,null,{"$f":"IF(D44=\"\",\"\",IFERROR(INDEX(dUnits,MATCH($D44&$F44&$H44,dSector&dCategory&dMeasure,0)),\" - \"))","v":""},null,{"$f":"IF(D44=\"\",\"\",IFERROR(INDEX(dWeatherSensitive,MATCH('Data Input'!$D44&'Data Input'!$F44&'Data Input'!$H44,dSector&dCategory&dMeasure,0)),\" - \"))","v":""}]
[null,null,8,null,null,null,null,null,null,null,null,{"$f":"IF(D45=\"\",\"\",IFERROR(INDEX(dUnits,MATCH($D45&$F45&$H45,dSector&dCategory&dMeasure,0)),\" - \"))","v":""},null,{"$f":"IF(D45=\"\",\"\",IFERROR(INDEX(dWeatherSensitive,MATCH('Data Input'!$D45&'Data Input'!$F45&'Data Input'!$H45,dSector&dCategory&dMeasure,0)),\" - \"))","v":""}]
[null,null,9,null,null,null,null,null,null,null,null,{"$f":"IF(D46=\"\",\"\",IFERROR(INDEX(dUnits,MATCH($D46&$F46&$H46,dSector&dCategory&dMeasure,0)),\" - \"))","v":""},null,{"$f":"IF(D46=\"\",\"\",IFERROR(INDEX(dWeatherSensitive,MATCH('Data Input'!$D46&'Data Input'!$F46&'Data Input'!$H46,dSector&dCategory&dMeasure,0)),\" - \"))","v":""}]
[null,null,10,null,null,null,null,null,null,null,null,{"$f":"IF(D47=\"\",\"\",IFERROR(INDEX(dUnits,MATCH($D47&$F47&$H47,dSector&dCategory&dMeasure,0)),\" - \"))","v":""},null,{"$f":"IF(D47=\"\",\"\",IFERROR(INDEX(dWeatherSensitive,MATCH('Data Input'!$D47&'Data Input'!$F47&'Data Input'!$H47,dSector&dCategory&dMeasure,0)),\" - \"))","v":""}]
[]
[]
[null,null,"If any measure is weather sensitive, select the closest:"]
[null,null,null,"Country",null,"City"]
[]
[null,null,null,"Heating Degree Days",null,{"$f":"WeatherData!C3","v":705}]
[null,null,null,"Cooling Degree Days",null,{"$f":"WeatherData!D3","v":30}]
[]
[null,"Assumptions"]
[null,"Document all assumptions or comments regarding the action or any of the data used for the estimation."]

{"sheet":"Calculations","index":2,"n_rows":45,"n_cols":23,"rows_kept":45,"cut":false,"hidden":false,"merged":[[23,11,24,11],[23,15,24,15],[46,2,51,11],[23,2,24,2],[23,3,24,3],[23,5,24,5],[23,7,24,7],[23,9,24,9],[23,8,24,8],[23,13,24,13],[23,14,24,14]]}
[]
[null,"Calculations"]
[]
[null,"Review the emission reduction calculations. Enter alternate values in the blue fields, if desired."]
[]
[]
[null,"Emission Reductions Calculations"]
[null,null,"NA = Not Applicable due to the options selected."]
[]
[]
[null,null,"Building Energy Efficiency"]
[]
[null,null,null,"Default Values",null,"Alternate Values"]
[]
[null,null,"Country",{"$f":"IF(CountryInput=\"\",\"\",CountryInput)","v":""}]
[null,null,"Grid Emission Factor (gCO2e/kWh)",{"$f":"IF(D15=\"\",\"\",VLOOKUP(D15,'Country Parameters'!$B$4:$K$198,10,FALSE))","v":""}]
[null,null,"Grid Line Loss Rate",{"$f":"IF(D15=\"\",\"\",VLOOKUP(D15,'Country Parameters'!$B$4:$R$198,17,FALSE))","v":""}]
[null,null,"Fossil Fuel (Natural Gas) Emission Factor (gCO2e/GJ) ",{"$f":"IF(D15=\"\",\"\",'Fuel EFs'!M42)","v":""}]
[]
[]
[null,null,"Calculations"]
[]
[null,null,null,null,null,null,null,null,"Consumption Per Unit",null,null,null,null,null,"Total Consumption"]
[null,null,"Baseline Description","Action Description",null,"Units of Consumption",null,"Baseline Energy Consumption \n(or savings only)","Action Energy Consumption","Annual Energy Savings",null,"Number of Units",null,"Baseline Energy Consumption","Action Energy Consumption","Total Annual Energy Savings"]
[]
[null,null,{"$f":"IF('Data Input'!D38=\"\",\"\",IFERROR(INDEX(dBaselineDesc,MATCH('Data Input'!$D38&'Data Input'!$F38&'Data Input'!$H38,dSector&dCategory&dMeasure,0)),\" - \"))","v":""},{"$f":"IF('Data Input'!D38=\"\",\"\",IFERROR(INDEX(dUpgradeDesc,MATCH('Data Input'!$D38&'Data Input'!$F38&'Data Input'!$H38,dSector&dCategory&dMeasure,0)),\" - \"))","v":""},null,{"$f":"IF(D26=\"\",\"\",IF(INDEX(bBaselineTherms,MATCH('Data Input'!$D38&'Data Input'!$F38&'Data Input'!$H38,dSector&dCategory&dMeasure,0))=0,\"kWh per Unit\", \"Therms per Unit\"))","v":""},null,{"$f":"IF(C26=\"\",\"\",IFERROR(INDEX(bBaselinekWh,MATCH('Data Input'!$D38&'Data Input'!$F38&'Data Input'!$H38,dSector&dCategory&dMeasure,0))*IF('Data Input'!$N38=\"Yes\",INDEX(dCoolingRatio,MATCH('Data Input'!$D38&'Data Input'!$F38&'Data Input'!$H38,dSector&dCategory&dMeasure,0)),1),\" - \")+IFERROR(INDEX(bBaselineTherms,MATCH('Data Input'!$D38&'Data Input'!$F38&'Data Input'!$H38,dSector&dCategory&dMeasure,0)),\" - \"))","v":""},{"$f":"IF(C26=\"\",\"\",IFERROR(INDEX(bUpgradekWh,MATCH('Data Input'!$D38&'Data Input'!$F38&'Data Input'!$H38,dSector&dCategory&dMeasure,0))*IF('Data Input'!$N38=\"Yes\",INDEX(dCoolingRatio,MATCH('Data Input'!$D38&'Data Input'!$F38&'Data Input'!$H38,dSector&dCategory&dMeasure,0)),1),\" - \")+IFERROR(INDEX(bUpgradeTherms,MATCH('Data Input'!$D38&'Data Input'!$F38&'Data Input'!$H38,dSector&dCategory&dMeasure,0)),\" - \"))","v":""},{"$f":"IF(C26=\"\",\"\",IFERROR(INDEX(IF('Data Input'!$N38=\"No\",dAnnualkWh,dAdjAnnualkWh),MATCH('Data Input'!$D38&'Data Input'!$F38&'Data Input'!$H38,dSector&dCategory&dMeasure,0)),\" - \")+IFERROR(INDEX(dAnnualFF,MATCH('Data Input'!$D38&'Data Input'!$F38&'Data Input'!$H38,dSector&dCategory&dMeasure,0)),\" - \"))","v":""},null,{"$f":"IF(C26=\"\",\"\",'Data Input'!J38)","v":""},null,{"$f":"IF(C26=\"\",\"\",L26*H26)","v":""},{"$f":"IF(C26=\"\",\"\",L26*I26)","v":""},{"$f":"IF(C26=\"\",\"\",L26*J26)","v":""},null,null,null,null,null,null,"P"]
[null,null,{"$f":"IF('Data Input'!D39=\"\",\"\",IFERROR(INDEX(dBaselineDesc,MATCH('Data Input'!$D39&'Data Input'!$F39&'Data Input'!$H39,dSector&dCategory&dMeasure,0)),\" - \"))","v":""},{"$f":"IF('Data Input'!D39=\"\",\"\",IFERROR(INDEX(dUpgradeDesc,MATCH('Data Input'!$D39&'Data Input'!$F39&'Data Input'!$H39,dSector&dCategory&dMeasure,0)),\" - \"))","v":""},null,{"$f":"IF(D27=\"\",\"\",IF(INDEX(bBaselineTherms,MATCH('Data Input'!$D39&'Data Input'!$F39&'Data Input'!$H39,dSector&dCategory&dMeasure,0))=0,\"kWh per Unit\", \"Therms per Unit\"))","v":""},null,{"$f":"IF(C27=\"\",\"\",IFERROR(INDEX(bBaselinekWh,MATCH('Data Input'!$D39&'Data Input'!$F39&'Data Input'!$H39,dSector&dCategory&dMeasure,0))*IF('Data Input'!$N39=\"Yes\",INDEX(dCoolingRatio,MATCH('Data Input'!$D39&'Data Input'!$F39&'Data Input'!$H39,dSector&dCategory&dMeasure,0)),1),\" - \")+IFERROR(INDEX(bBaselineTherms,MATCH('Data Input'!$D39&'Data Input'!$F39&'Data Input'!$H39,dSector&dCategory&dMeasure,0)),\" - \"))","v":""},{"$f":"IF(C27=\"\",\"\",IFERROR(INDEX(bUpgradekWh,MATCH('Data Input'!$D39&'Data Input'!$F39&'Data Input'!$H39,dSector&dCategory&dMeasure,0))*IF('Data Input'!$N39=\"Yes\",INDEX(dCoolingRatio,MATCH('Data Input'!$D39&'Data Input'!$F39&'Data Input'!$H39,dSector&dCategory&dMeasure,0)),1),\" - \")+IFERROR(INDEX(bUpgradeTherms,MATCH('Data Input'!$D39&'Data Input'!$F39&'Data Input'!$H39,dSector&dCategory&dMeasure,0)),\" - \"))","v":""},{"$f":"IF(C27=\"\",\"\",IFERROR(INDEX(IF('Data Input'!$N39=\"No\",dAnnualkWh,dAdjAnnualkWh),MATCH('Data Input'!$D39&'Data Input'!$F39&'Data Input'!$H39,dSector&dCategory&dMeasure,0)),\" - \")+IFERROR(INDEX(dAnnualFF,MATCH('Data Input'!$D39&'Data Input'!$F39&'Data Input'!$H39,dSector&dCategory&dMeasure,0)),\" - \"))","v":""},null,{"$f":"IF(C27=\"\",\"\",'Data Input'!J39)","v":""},null,{"$f":"IF(C27=\"\",\"\",L27*H27)","v":""},{"$f":"IF(C27=\"\",\"\",L27*I27)","v":""},{"$f":"IF(C27=\"\",\"\",L27*J27)","v":""},null,null,null,null,null,null,"Q"]
[null,null,{"$f":"IF('Data Input'!D40=\"\",\"\",IFERROR(INDEX(dBaselineDesc,MATCH('Data Input'!$D40&'Data Input'!$F40&'Data Input'!$H40,dSector&dCategory&dMeasure,0)),\" - \"))","v":""},{"$f":"IF('Data Input'!D40=\"\",\"\",IFERROR(INDEX(dUpgradeDesc,MATCH('Data Input'!$D40&'Data Input'!$F40&'Data Input'!$H40,dSector&dCategory&dMeasure,0)),\" - \"))","v":""},null,{"$f":"IF(D28=\"\",\"\",IF(INDEX(bBaselineTherms,MATCH('Data Input'!$D40&'Data Input'!$F40&'Data Input'!$H40,dSector&dCategory&dMeasure,0))=0,\"kWh per Unit\", \"Therms per Unit\"))","v":""},null,{"$f":"IF(C28=\"\",\"\",IFERROR(INDEX(bBaselinekWh,MATCH('Data Input'!$D40&'Data Input'!$F40&'Data Input'!$H40,dSector&dCategory&dMeasure,0))*IF('Data Input'!$N40=\"Yes\",INDEX(dCoolingRatio,MATCH('Data Input'!$D40&'Data Input'!$F40&'Data Input'!$H40,dSector&dCategory&dMeasure,0)),1),\" - \")+IFERROR(INDEX(bBaselineTherms,MATCH('Data Input'!$D40&'Data Input'!$F40&'Data Input'!$H40,dSector&dCategory&dMeasure,0)),\" - \"))","v":""},{"$f":"IF(C28=\"\",\"\",IFERROR(INDEX(bUpgradekWh,MATCH('Data Input'!$D40&'Data Input'!$F40&'Data Input'!$H40,dSector&dCategory&dMeasure,0))*IF('Data Input'!$N40=\"Yes\",INDEX(dCoolingRatio,MATCH('Data Input'!$D40&'Data Input'!$F40&'Data Input'!$H40,dSector&dCategory&dMeasure,0)),1),\" - \")+IFERROR(INDEX(bUpgradeTherms,MATCH('Data Input'!$D40&'Data Input'!$F40&'Data Input'!$H40,dSector&dCategory&dMeasure,0)),\" - \"))","v":""},{"$f":"IF(C28=\"\",\"\",IFERROR(INDEX(IF('Data Input'!$N40=\"No\",dAnnualkWh,dAdjAnnualkWh),MATCH('Data Input'!$D40&'Data Input'!$F40&'Data Input'!$H40,dSector&dCategory&dMeasure,0)),\" - \")+IFERROR(INDEX(dAnnualFF,MATCH('Data Input'!$D40&'Data Input'!$F40&'Data Input'!$H40,dSector&dCategory&dMeasure,0)),\" - \"))","v":""},null,{"$f":"IF(C28=\"\",\"\",'Data Input'!J40)","v":""},null,"","","",null,null,null,null,null,null,"R"]
[null,null,{"$f":"IF('Data Input'!D41=\"\",\"\",IFERROR(INDEX(dBaselineDesc,MATCH('Data Input'!$D41&'Data Input'!$F41&'Data Input'!$H41,dSector&dCategory&dMeasure,0)),\" - \"))","v":""},{"$f":"IF('Data Input'!D41=\"\",\"\",IFERROR(INDEX(dUpgradeDesc,MATCH('Data Input'!$D41&'Data Input'!$F41&'Data Input'!$H41,dSector&dCategory&dMeasure,0)),\" - \"))","v":""},null,{"$f":"IF(D29=\"\",\"\",IF(INDEX(bBaselineTherms,MATCH('Data Input'!$D41&'Data Input'!$F41&'Data Input'!$H41,dSector&dCategory&dMeasure,0))=0,\"kWh per Unit\", \"Therms per Unit\"))","v":""},null,{"$f":"IF(C29=\"\",\"\",IFERROR(INDEX(bBaselinekWh,MATCH('Data Input'!$D41&'Data Input'!$F41&'Data Input'!$H41,dSector&dCategory&dMeasure,0))*IF('Data Input'!$N41=\"Yes\",INDEX(dCoolingRatio,MATCH('Data Input'!$D41&'Data Input'!$F41&'Data Input'!$H41,dSector&dCategory&dMeasure,0)),1),\" - \")+IFERROR(INDEX(bBaselineTherms,MATCH('Data Input'!$D41&'Data Input'!$F41&'Data Input'!$H41,dSector&dCategory&dMeasure,0)),\" - \"))","v":""},{"$f":"IF(C29=\"\",\"\",IFERROR(INDEX(bUpgradekWh,MATCH('Data Input'!$D41&'Data Input'!$F41&'Data Input'!$H41,dSector&dCategory&dMeasure,0))*IF('Data Input'!$N41=\"Yes\",INDEX(dCoolingRatio,MATCH('Data Input'!$D41&'Data Input'!$F41&'Data Input'!$H41,dSector&dCategory&dMeasure,0)),1),\" - \")+IFERROR(INDEX(bUpgradeTherms,MATCH('Data Input'!$D41&'Data Input'!$F41&'Data Input'!$H41,dSector&dCategory&dMeasure,0)),\" - \"))","v":""},{"$f":"IF(C29=\"\",\"\",IFERROR(INDEX(IF('Data Input'!$N41=\"No\",dAnnualkWh,dAdjAnnualkWh),MATCH('Data Input'!$D41&'Data Input'!$F41&'Data Input'!$H41,dSector&dCategory&dMeasure,0)),\" - \")+IFERROR(INDEX(dAnnualFF,MATCH('Data Input'!$D41&'Data Input'!$F41&'Data Input'!$H41,dSector&dCategory&dMeasure,0)),\" - \"))","v":""},null,{"$f":"IF(C29=\"\",\"\",'Data Input'!J41)","v":""},null,"","","",null,null,null,null,null,null,"S"]
[null,null,{"$f":"IF('Data Input'!D42=\"\",\"\",IFERROR(INDEX(dBaselineDesc,MATCH('Data Input'!$D42&'Data Input'!$F42&'Data Input'!$H42,dSector&dCategory&dMeasure,0)),\" - \"))","v":""},{"$f":"IF('Data Input'!D42=\"\",\"\",IFERROR(INDEX(dUpgradeDesc,MATCH('Data Input'!$D42&'Data Input'!$F42&'Data Input'!$H42,dSector&dCategory&dMeasure,0)),\" - \"))","v":""},null,{"$f":"IF(D30=\"\",\"\",IF(INDEX(bBaselineTherms,MATCH('Data Input'!$D42&'Data Input'!$F42&'Data Input'!$H42,dSector&dCategory&dMeasure,0))=0,\"kWh per Unit\", \"Therms per Unit\"))","v":""},null,{"$f":"IF(C30=\"\",\"\",IFERROR(INDEX(bBaselinekWh,MATCH('Data Input'!$D42&'Data Input'!$F42&'Data Input'!$H42,dSector&dCategory&dMeasure,0))*IF('Data Input'!$N42=\"Yes\",INDEX(dCoolingRatio,MATCH('Data Input'!$D42&'Data Input'!$F42&'Data Input'!$H42,dSector&dCategory&dMeasure,0)),1),\" - \")+IFERROR(INDEX(bBaselineTherms,MATCH('Data Input'!$D42&'Data Input'!$F42&'Data Input'!$H42,dSector&dCategory&dMeasure,0)),\" - \"))","v":""},{"$f":"IF(C30=\"\",\"\",IFERROR(INDEX(bUpgradekWh,MATCH('Data Input'!$D42&'Data Input'!$F42&'Data Input'!$H42,dSector&dCategory&dMeasure,0))*IF('Data Input'!$N42=\"Yes\",INDEX(dCoolingRatio,MATCH('Data Input'!$D42&'Data Input'!$F42&'Data Input'!$H42,dSector&dCategory&dMeasure,0)),1),\" - \")+IFERROR(INDEX(bUpgradeTherms,MATCH('Data Input'!$D42&'Data Input'!$F42&'Data Input'!$H42,dSector&dCategory&dMeasure,0)),\" - \"))","v":""},{"$f":"IF(C30=\"\",\"\",IFERROR(INDEX(IF('Data Input'!$N42=\"No\",dAnnualkWh,dAdjAnnualkWh),MATCH('Data Input'!$D42&'Data Input'!$F42&'Data Input'!$H42,dSector&dCategory&dMeasure,0)),\" - \")+IFERROR(INDEX(dAnnualFF,MATCH('Data Input'!$D42&'Data Input'!$F42&'Data Input'!$H42,dSector&dCategory&dMeasure,0)),\" - \"))","v":""},null,{"$f":"IF(C30=\"\",\"\",'Data Input'!J42)","v":""},null,"","","",null,null,null,null,null,null,"T"]
[null,null,{"$f":"IF('Data Input'!D43=\"\",\"\",IFERROR(INDEX(dBaselineDesc,MATCH('Data Input'!$D43&'Data Input'!$F43&'Data Input'!$H43,dSector&dCategory&dMeasure,0)),\" - \"))","v":""},{"$f":"IF('Data Input'!D43=\"\",\"\",IFERROR(INDEX(dUpgradeDesc,MATCH('Data Input'!$D43&'Data Input'!$F43&'Data Input'!$H43,dSector&dCategory&dMeasure,0)),\" - \"))","v":""},null,{"$f":"IF(D31=\"\",\"\",IF(INDEX(bBaselineTherms,MATCH('Data Input'!$D43&'Data Input'!$F43&'Data Input'!$H43,dSector&dCategory&dMeasure,0))=0,\"kWh per Unit\", \"Therms per Unit\"))","v":""},null,{"$f":"IF(C31=\"\",\"\",IFERROR(INDEX(bBaselinekWh,MATCH('Data Input'!$D43&'Data Input'!$F43&'Data Input'!$H43,dSector&dCategory&dMeasure,0))*IF('Data Input'!$N43=\"Yes\",INDEX(dCoolingRatio,MATCH('Data Input'!$D43&'Data Input'!$F43&'Data Input'!$H43,dSector&dCategory&dMeasure,0)),1),\" - \")+IFERROR(INDEX(bBaselineTherms,MATCH('Data Input'!$D43&'Data Input'!$F43&'Data Input'!$H43,dSector&dCategory&dMeasure,0)),\" - \"))","v":""},{"$f":"IF(C31=\"\",\"\",IFERROR(INDEX(bUpgradekWh,MATCH('Data Input'!$D43&'Data Input'!$F43&'Data Input'!$H43,dSector&dCategory&dMeasure,0))*IF('Data Input'!$N43=\"Yes\",INDEX(dCoolingRatio,MATCH('Data Input'!$D43&'Data Input'!$F43&'Data Input'!$H43,dSector&dCategory&dMeasure,0)),1),\" - \")+IFERROR(INDEX(bUpgradeTherms,MATCH('Data Input'!$D43&'Data Input'!$F43&'Data Input'!$H43,dSector&dCategory&dMeasure,0)),\" - \"))","v":""},{"$f":"IF(C31=\"\",\"\",IFERROR(INDEX(IF('Data Input'!$N43=\"No\",dAnnualkWh,dAdjAnnualkWh),MATCH('Data Input'!$D43&'Data Input'!$F43&'Data Input'!$H43,dSector&dCategory&dMeasure,0)),\" - \")+IFERROR(INDEX(dAnnualFF,MATCH('Data Input'!$D43&'Data Input'!$F43&'Data Input'!$H43,dSector&dCategory&dMeasure,0)),\" - \"))","v":""},null,{"$f":"IF(C31=\"\",\"\",'Data Input'!J43)","v":""},null,"","","",null,null,null,null,null,null,"U"]
[null,null,{"$f":"IF('Data Input'!D44=\"\",\"\",IFERROR(INDEX(dBaselineDesc,MATCH('Data Input'!$D44&'Data Input'!$F44&'Data Input'!$H44,dSector&dCategory&dMeasure,0)),\" - \"))","v":""},{"$f":"IF('Data Input'!D44=\"\",\"\",IFERROR(INDEX(dUpgradeDesc,MATCH('Data Input'!$D44&'Data Input'!$F44&'Data Input'!$H44,dSector&dCategory&dMeasure,0)),\" - \"))","v":""},null,{"$f":"IF(D32=\"\",\"\",IF(INDEX(bBaselineTherms,MATCH('Data Input'!$D44&'Data Input'!$F44&'Data Input'!$H44,dSector&dCategory&dMeasure,0))=0,\"kWh per Unit\", \"Therms per Unit\"))","v":""},null,{"$f":"IF(C32=\"\",\"\",IFERROR(INDEX(bBaselinekWh,MATCH('Data Input'!$D44&'Data Input'!$F44&'Data Input'!$H44,dSector&dCategory&dMeasure,0))*IF('Data Input'!$N44=\"Yes\",INDEX(dCoolingRatio,MATCH('Data Input'!$D44&'Data Input'!$F44&'Data Input'!$H44,dSector&dCategory&dMeasure,0)),1),\" - \")+IFERROR(INDEX(bBaselineTherms,MATCH('Data Input'!$D44&'Data Input'!$F44&'Data Input'!$H44,dSector&dCategory&dMeasure,0)),\" - \"))","v":""},{"$f":"IF(C32=\"\",\"\",IFERROR(INDEX(bUpgradekWh,MATCH('Data Input'!$D44&'Data Input'!$F44&'Data Input'!$H44,dSector&dCategory&dMeasure,0))*IF('Data Input'!$N44=\"Yes\",INDEX(dCoolingRatio,MATCH('Data Input'!$D44&'Data Input'!$F44&'Data Input'!$H44,dSector&dCategory&dMeasure,0)),1),\" - \")+IFERROR(INDEX(bUpgradeTherms,MATCH('Data Input'!$D44&'Data Input'!$F44&'Data Input'!$H44,dSector&dCategory&dMeasure,0)),\" - \"))","v":""},{"$f":"IF(C32=\"\",\"\",IFERROR(INDEX(IF('Data Input'!$N44=\"No\",dAnnualkWh,dAdjAnnualkWh),MATCH('Data Input'!$D44&'Data Input'!$F44&'Data Input'!$H44,dSector&dCategory&dMeasure,0)),\" - \")+IFERROR(INDEX(dAnnualFF,MATCH('Data Input'!$D44&'Data Input'!$F44&'Data Input'!$H44,dSector&dCategory&dMeasure,0)),\" - \"))","v":""},null,{"$f":"IF(C32=\"\",\"\",'Data Input'!J44)","v":""},null,"","","",null,null,null,null,null,null,"V"]
[null,null,{"$f":"IF('Data Input'!D45=\"\",\"\",IFERROR(INDEX(dBaselineDesc,MATCH('Data Input'!$D45&'Data Input'!$F45&'Data Input'!$H45,dSector&dCategory&dMeasure,0)),\" - \"))","v":""},{"$f":"IF('Data Input'!D45=\"\",\"\",IFERROR(INDEX(dUpgradeDesc,MATCH('Data Input'!$D45&'Data Input'!$F45&'Data Input'!$H45,dSector&dCategory&dMeasure,0)),\" - \"))","v":""},null,{"$f":"IF(D33=\"\",\"\",IF(INDEX(bBaselineTherms,MATCH('Data Input'!$D45&'Data Input'!$F45&'Data Input'!$H45,dSector&dCategory&dMeasure,0))=0,\"kWh per Unit\", \"Therms per Unit\"))","v":""},null,{"$f":"IF(C33=\"\",\"\",IFERROR(INDEX(bBaselinekWh,MATCH('Data Input'!$D45&'Data Input'!$F45&'Data Input'!$H45,dSector&dCategory&dMeasure,0))*IF('Data Input'!$N45=\"Yes\",INDEX(dCoolingRatio,MATCH('Data Input'!$D45&'Data Input'!$F45&'Data Input'!$H45,dSector&dCategory&dMeasure,0)),1),\" - \")+IFERROR(INDEX(bBaselineTherms,MATCH('Data Input'!$D45&'Data Input'!$F45&'Data Input'!$H45,dSector&dCategory&dMeasure,0)),\" - \"))","v":""},{"$f":"IF(C33=\"\",\"\",IFERROR(INDEX(bUpgradekWh,MATCH('Data Input'!$D45&'Data Input'!$F45&'Data Input'!$H45,dSector&dCategory&dMeasure,0))*IF('Data Input'!$N45=\"Yes\",INDEX(dCoolingRatio,MATCH('Data Input'!$D45&'Data Input'!$F45&'Data Input'!$H45,dSector&dCategory&dMeasure,0)),1),\" - \")+IFERROR(INDEX(bUpgradeTherms,MATCH('Data Input'!$D45&'Data Input'!$F45&'Data Input'!$H45,dSector&dCategory&dMeasure,0)),\" - \"))","v":""},{"$f":"IF(C33=\"\",\"\",IFERROR(INDEX(IF('Data Input'!$N45=\"No\",dAnnualkWh,dAdjAnnualkWh),MATCH('Data Input'!$D45&'Data Input'!$F45&'Data Input'!$H45,dSector&dCategory&dMeasure,0)),\" - \")+IFERROR(INDEX(dAnnualFF,MATCH('Data Input'!$D45&'Data Input'!$F45&'Data Input'!$H45,dSector&dCategory&dMeasure,0)),\" - \"))","v":""},null,{"$f":"IF(C33=\"\",\"\",'Data Input'!J45)","v":""},null,"","","",null,null,null,null,null,null,"W"]
[null,null,{"$f":"IF('Data Input'!D46=\"\",\"\",IFERROR(INDEX(dBaselineDesc,MATCH('Data Input'!$D46&'Data Input'!$F46&'Data Input'!$H46,dSector&dCategory&dMeasure,0)),\" - \"))","v":""},{"$f":"IF('Data Input'!D46=\"\",\"\",IFERROR(INDEX(dUpgradeDesc,MATCH('Data Input'!$D46&'Data Input'!$F46&'Data Input'!$H46,dSector&dCategory&dMeasure,0)),\" - \"))","v":""},null,{"$f":"IF(D34=\"\",\"\",IF(INDEX(bBaselineTherms,MATCH('Data Input'!$D46&'Data Input'!$F46&'Data Input'!$H46,dSector&dCategory&dMeasure,0))=0,\"kWh per Unit\", \"Therms per Unit\"))","v":""},null,{"$f":"IF(C34=\"\",\"\",IFERROR(INDEX(bBaselinekWh,MATCH('Data Input'!$D46&'Data Input'!$F46&'Data Input'!$H46,dSector&dCategory&dMeasure,0))*IF('Data Input'!$N46=\"Yes\",INDEX(dCoolingRatio,MATCH('Data Input'!$D46&'Data Input'!$F46&'Data Input'!$H46,dSector&dCategory&dMeasure,0)),1),\" - \")+IFERROR(INDEX(bBaselineTherms,MATCH('Data Input'!$D46&'Data Input'!$F46&'Data Input'!$H46,dSector&dCategory&dMeasure,0)),\" - \"))","v":""},{"$f":"IF(C34=\"\",\"\",IFERROR(INDEX(bUpgradekWh,MATCH('Data Input'!$D46&'Data Input'!$F46&'Data Input'!$H46,dSector&dCategory&dMeasure,0))*IF('Data Input'!$N46=\"Yes\",INDEX(dCoolingRatio,MATCH('Data Input'!$D46&'Data Input'!$F46&'Data Input'!$H46,dSector&dCategory&dMeasure,0)),1),\" - \")+IFERROR(INDEX(bUpgradeTherms,MATCH('Data Input'!$D46&'Data Input'!$F46&'Data Input'!$H46,dSector&dCategory&dMeasure,0)),\" - \"))","v":""},{"$f":"IF(C34=\"\",\"\",IFERROR(INDEX(IF('Data Input'!$N46=\"No\",dAnnualkWh,dAdjAnnualkWh),MATCH('Data Input'!$D46&'Data Input'!$F46&'Data Input'!$H46,dSector&dCategory&dMeasure,0)),\" - \")+IFERROR(INDEX(dAnnualFF,MATCH('Data Input'!$D46&'Data Input'!$F46&'Data Input'!$H46,dSector&dCategory&dMeasure,0)),\" - \"))","v":""},null,{"$f":"IF(C34=\"\",\"\",'Data Input'!J46)","v":""},null,"","","",null,null,null,null,null,null,"X"]
[null,null,{"$f":"IF('Data Input'!D47=\"\",\"\",IFERROR(INDEX(dBaselineDesc,MATCH('Data Input'!$D47&'Data Input'!$F47&'Data Input'!$H47,dSector&dCategory&dMeasure,0)),\" - \"))","v":""},{"$f":"IF('Data Input'!D47=\"\",\"\",IFERROR(INDEX(dUpgradeDesc,MATCH('Data Input'!$D47&'Data Input'!$F47&'Data Input'!$H47,dSector&dCategory&dMeasure,0)),\" - \"))","v":""},null,{"$f":"IF(D35=\"\",\"\",IF(INDEX(bBaselineTherms,MATCH('Data Input'!$D47&'Data Input'!$F47&'Data Input'!$H47,dSector&dCategory&dMeasure,0))=0,\"kWh per Unit\", \"Therms per Unit\"))","v":""},null,{"$f":"IF(C35=\"\",\"\",IFERROR(INDEX(bBaselinekWh,MATCH('Data Input'!$D47&'Data Input'!$F47&'Data Input'!$H47,dSector&dCategory&dMeasure,0))*IF('Data Input'!$N47=\"Yes\",INDEX(dCoolingRatio,MATCH('Data Input'!$D47&'Data Input'!$F47&'Data Input'!$H47,dSector&dCategory&dMeasure,0)),1),\" - \")+IFERROR(INDEX(bBaselineTherms,MATCH('Data Input'!$D47&'Data Input'!$F47&'Data Input'!$H47,dSector&dCategory&dMeasure,0)),\" - \"))","v":""},{"$f":"IF(C35=\"\",\"\",IFERROR(INDEX(bUpgradekWh,MATCH('Data Input'!$D47&'Data Input'!$F47&'Data Input'!$H47,dSector&dCategory&dMeasure,0))*IF('Data Input'!$N47=\"Yes\",INDEX(dCoolingRatio,MATCH('Data Input'!$D47&'Data Input'!$F47&'Data Input'!$H47,dSector&dCategory&dMeasure,0)),1),\" - \")+IFERROR(INDEX(bUpgradeTherms,MATCH('Data Input'!$D47&'Data Input'!$F47&'Data Input'!$H47,dSector&dCategory&dMeasure,0)),\" - \"))","v":""},{"$f":"IF(C35=\"\",\"\",IFERROR(INDEX(IF('Data Input'!$N47=\"No\",dAnnualkWh,dAdjAnnualkWh),MATCH('Data Input'!$D47&'Data Input'!$F47&'Data Input'!$H47,dSector&dCategory&dMeasure,0)),\" - \")+IFERROR(INDEX(dAnnualFF,MATCH('Data Input'!$D47&'Data Input'!$F47&'Data Input'!$H47,dSector&dCategory&dMeasure,0)),\" - \"))","v":""},null,{"$f":"IF(C35=\"\",\"\",'Data Input'!J47)","v":""},null,"","","",null,null,null,null,null,null,"Y"]
[]
[null,null,null,"Total kWh",null,null,null,{"$f":"IF(SUM(H26:H35)=0,\"\",SUMIF(F26:F35,\"kWh per Unit\",H26:H35))","v":""},{"$f":"IF(SUM(I26:I35)=0,\"\",SUMIF(G26:G35,\"kWh per Unit\",I26:I35))","v":""},{"$f":"IF(SUM(J26:J35)=0,\"\",SUMIF(F26:F35,\"kWh per Unit\",J26:J35))","v":""},null,null,null,{"$f":"IF(SUM(N26:N35)=0,\"\",SUMIF(F26:F35,\"kWh per Unit\",N26:N35))","v":""},{"$f":"IF(SUM(O26:O35)=0,\"\",SUMIF(G26:G35,\"kWh per Unit\",O26:O35))","v":""},{"$f":"IF(SUM(P26:P35)=0,\"\",SUMIF(F26:F35,\"kWh per Unit\",P26:P35))","v":""}]
[null,null,null,"Total Therms",null,null,null,{"$f":"IF(SUM(H26:H35)=0,\"\",SUMIF(F26:F35,\"Therms per Unit\",H26:H35))","v":""},{"$f":"IF(SUM(I26:I35)=0,\"\",SUMIF(G26:G35,\"Therms per Unit\",I26:I35))","v":""},{"$f":"IF(SUM(J26:J35)=0,\"\",SUMIF(F26:F35,\"Therms per Unit\",J26:J35))","v":""},null,null,null,{"$f":"IF(SUM(N26:N35)=0,\"\",SUMIF(F26:F35,\"Therms per Unit\",N26:N35))","v":""},{"$f":"IF(SUM(O26:O35)=0,\"\",SUMIF(G26:G35,\"Therms per Unit\",O26:O35))","v":""},{"$f":"IF(SUM(P26:P35)=0,\"\",SUMIF(F26:F35,\"Therms per Unit\",P26:P35))","v":""}]
[null,null,null,"Total (GJ)",null,null,null,{"$f":"IF(H37=\"\",\"\",H37*Conversions!$K$50+H38*Conversions!$K$59)","v":""},{"$f":"IF(I37=\"\",\"\",I37*Conversions!$K$50+I38*Conversions!$K$59)","v":""},{"$f":"IF(J37=\"\",\"\",J37*Conversions!$K$50+J38*Conversions!$K$59)","v":""},null,null,null,{"$f":"IF(N37=\"\",\"\",N37*Conversions!$K$50+N38*Conversions!$K$59)","v":""},{"$f":"IF(O37=\"\",\"\",O37*Conversions!$K$50+O38*Conversions!$K$59)","v":""},{"$f":"IF(P37=\"\",\"\",P37*Conversions!$K$50+P38*Conversions!$K$59)","v":""}]
[null,null,null,"Total Emissions (gCO2e)",null,null,null,{"$f":"IF(H37=\"\",\"\",H37/(1-(IF($F$17=\"\",$D$17,$F$17)))*(IF($F$16=\"\",$D$16,$F$16))+H38*Conversions!$K$59*(IF($F$18=\"\",$D$18,$F$18)))","v":""},{"$f":"IF(I37=\"\",\"\",I37/(1-(IF($F$17=\"\",$D$17,$F$17)))*(IF($F$16=\"\",$D$16,$F$16))+I38*Conversions!$K$59*(IF($F$18=\"\",$D$18,$F$18)))","v":""},{"$f":"IF(J37=\"\",\"\",J37/(1-(IF($F$17=\"\",$D$17,$F$17)))*(IF($F$16=\"\",$D$16,$F$16))+J38*Conversions!$K$59*(IF($F$18=\"\",$D$18,$F$18)))","v":""},null,null,null,{"$f":"IF(N37=\"\",\"\",N37/(1-(IF($F$17=\"\",$D$17,$F$17)))*(IF($F$16=\"\",$D$16,$F$16))+N38*Conversions!$K$59*(IF($F$18=\"\",$D$18,$F$18)))","v":""},{"$f":"IF(O37=\"\",\"\",O37/(1-(IF($F$17=\"\",$D$17,$F$17)))*(IF($F$16=\"\",$D$16,$F$16))+O38*Conversions!$K$59*(IF($F$18=\"\",$D$18,$F$18)))","v":""},{"$f":"IF(P37=\"\",\"\",P37/(1-(IF($F$17=\"\",$D$17,$F$17)))*(IF($F$16=\"\",$D$16,$F$16))+P38*Conversions!$K$59*(IF($F$18=\"\",$D$18,$F$18)))","v":""}]
[null,null,null,"Total Emissions (tCO2e)",null,null,null,{"$f":"IF(H40=\"\",\"\",H40/Conversions!$D$81)","v":""},{"$f":"IF(I40=\"\",\"\",I40/Conversions!$D$81)","v":""},{"$f":"IF(J40=\"\",\"\",J40/Conversions!$D$81)","v":""},null,null,null,{"$f":"IF(N40=\"\",\"\",N40/Conversions!$D$81)","v":""},{"$f":"IF(O40=\"\",\"\",O40/Conversions!$D$81)","v":""},{"$f":"IF(P40=\"\",\"\",P40/Conversions!$D$81)","v":""}]
[]
[]
[null,"Assumptions"]
[null,"Document all assumptions or comments regarding the alternate values used for the estimation."]

{"sheet":"Results","index":3,"n_rows":36,"n_cols":8,"rows_kept":36,"cut":false,"hidden":false,"merged":[[35,2,40,11]]}
[]
[null,"Results"]
[]
[]
[null,"This page summarizes total FY emissions reduced or avoided (tCO2e). Report Total FY Emission Reductions in the green field for Indicator 4.8-7."]
[]
[null,"Results and Summary"]
[]
[null,"Action Information Summary"]
[null,null,"Implementing Mechanism Number",null,null,{"$f":"IF('Data Input'!F14=\"\",\"\",'Data Input'!F14)","v":""}]
[null,null,"Implementing Mechanism Name",null,null,{"$f":"IF('Data Input'!F15=\"\",\"\",'Data Input'!F15)","v":""}]
[null,null,"Action Name",null,null,{"$f":"IF('Data Input'!F16=\"\",\"\",'Data Input'!F16)","v":""}]
[null,null,"Operating Unit",null,null,{"$f":"IF('Data Input'!F18=\"\",\"\",'Data Input'!F18)","v":""}]
[null,null,"Implementing Partner",null,null,{"$f":"IF('Data Input'!F19=\"\",\"\",'Data Input'!F19)","v":""}]
[null,null,"Country",null,null,{"$f":"IF('Data Input'!F22=\"\",\"\",'Data Input'!F22)","v":""}]
[null,null,"Fiscal Year Reported",null,null,{"$f":"IF('Data Input'!F17=\"\",\"\",'Data Input'!F17)","v":""}]
[null,null,"Clean Energy Result",null,null,"Increase End-Use Energy Efficiency"]
[]
[]
[null,"Total Fiscal Year Emission Reductions"]
[]
[null,null,null,"Baseline Emissions (tCO2e)",null,"Activity Emissions (tCO2e)",null,"Total FY Emission Reductions (tCO2e)"]
[null,null,null,{"$f":"Calculations!N41","v":""},"-",{"$f":"Calculations!O41","v":""},"=",{"$f":"IF(D23=\"\",\"\",D23-F23)","v":""}]
[]
[null,null,null,"(kgCO2e)",null,"(kgCO2e)",null," (kgCO2e)"]
[null,null,null,{"$f":"IF(D23=\"\",\"\",TEXT(ROUND(IF(D23=\"\",\"\",D23*Conversions!$E$81),1),\"#,##0\"))","v":""},"-",{"$f":"IF(F23=\"\",\"\",TEXT(ROUND(IF(F23=\"\",\"\",F23*Conversions!$E$81),1),\"#,##0\"))","v":""},"=",{"$f":"IF(H23=\"\",\"\",TEXT(ROUND(IF(H23=\"\",\"\",H23*Conversions!$E$81),1),\"#,##0\"))","v":""}]
[]
[null,"Total Fiscal Year Energy Consumption Comparison"]
[]
[null,null,null,"Baseline Energy Consumption (GJ)",null,"Activity Energy Consumption (GJ)",null,"Total FY Energy Savings (GJ)"]
[null,null,null,{"$f":"Calculations!N39","v":""},"-",{"$f":"Calculations!O39","v":""},"=",{"$f":"IF(D31=\"\",\"\",D31-F31)","v":""}]
[]
[null,"Summary of Assumptions"]
[null,"Summary of all assumptions and comments."]
[]
[null,null,{"$f":"'Data Input'!C59&CHAR(10)&Calculations!C47","v":"\n"}]

{"sheet":"DataCollectionNeeds","index":4,"n_rows":58,"n_cols":5,"rows_kept":58,"cut":false,"hidden":false,"merged":[[8,1,8,5]]}
[]
[null,"Data Collection Needs"]
[]
[]
[null,"This page lists the necessary data the user should collect for estimating GHG emission reductions, which will vary by action."]
[]
[null,"Building Energy Efficiency Calculator Pathways"]
[]
[null,"Instructions: This calculator is capable of estimating emissions using different sets of inputs. Follow the diagram below to understand how sets of inputs are grouped together to complete the calculations. The diagram will also be helpful in determining information you may need to collect in the future. \nThe diagram is color-coded to differentiate the type of input. Highlighted data inputs are further explained in the table below the diagram. Blue shapes are questions asked in the calculator, which determine the set of inputs necessary. Grey shapes indicate a user-selected answer which are chosen from a drop down menu. Yellow shapes indicate a user-input that is manually entered. Green shapes indicate the option of entering an alternative value for a specific input. "]
[]
[]
[]
[]
[]
[]
[]
[]
[]
[]
[]
[]
[]
[]
[]
[]
[]
[]
[]
[]
[]
[]
[]
[]
[]
[]
[]
[]
[]
[]
[]
[]
[]
[null,"Building Energy Efficiency Calculator Data Collection Needs"]
[]
[null,"Source","Parameter","Definition","Typical Value/Units"]
[null,"User-Provided","Sector","The sector in which the energy efficiency measure was implemented","Residential \nCommercial"]
[null,"User-Provided","Category","The category of the energy efficiency measures","Sector-specific"]
[null,"User-Provided","Measure","The energy efficiency measures which are specific to the category chosen","Category-specific"]
[null,"User-Provided","Number of Units","The total number of units of efficiency installed under the measure","Measure-specific"]
[null,"User-Selected","Nameplate Power","Nameplate Power rating of the equipment","Kilowatt (kW)"]
[null,"Default: IEESAG (2012)","Operational Hours","Total number of hours the equipment is operational in the reporting year ","Hours (h)"]
[null,"Default: IEESAG (2012)","Full Load Hours","The total number of hours that the HVAC equipment is assumed to run at full load in the reporting year","Hours (h)"]
[null,"User-Selected","Nameplate Capacity","Nameplate capacity of the HVAC equipment ","Kilowatt (kW)"]
[null,"User-Selected","Coefficient of Performance","The amount of heat delivered per unit electricity consumed by the HVAC system","Measure-specific"]
[null,"Default: DOE EnergyPlus","Cooling Degree Days (CDD)","The cooling degree days of the selected city","Location-specific"]
[null,"Default: Based on Confidential Data","Constants","Constants are determined after a curve fit of office cooling electricity as a function of CDD","Unitless"]
[null,"Default: IEA (2009)","Line Loss Rate","Average grid line loss due to transmission and distribution (%), country specific","Percent (0-99%)"]
[null,"Default: IGES (2015)\nIEA (2014)","Grid Electricity Emission Factor","Average combined marginal GHG emission factor for grid electricity, by country","tCO2e/kWh of electricity"]

{"sheet":"Data","index":5,"n_rows":132,"n_cols":39,"rows_kept":132,"cut":false,"hidden":true,"merged":[]}
["Sector","Category","Measure","Upgrade Description","Baseline Description","Units (plural)","Lifetime (years)","Degradation Rate","Baseline (or savings only) kWh per unit","Upgrade kWh per unit","Baseline fossil fuels per unit (therms)","Upgrade fossil fuels per unit","Annual kWh Savings per unit","Annual fossil fuel savings per unit","Weather Sensitive?","Base HDD","Base CDD","Base Reference Cooling Energy","Selected City Reference Cooling Energy","Ratio of Selected City and Base City Cooling Energy ","Weather Adjusted kWh","Weather Adjusted fossil fuel","Ratio HDD","Ratio CDD","Notes","Calculations (including subsequent rows/columns)"]
["Residential","Lighting Upgrade","11W CFL replaces 40W Incandescent","Mini Spiral CFL - 11 W","Incandescent 40 W","bulbs",{"$f":"10000/(AE2*AG2)","v":10.660412557965994},0,{"$f":"AA2*$AE2*$AG2/1000","v":37.521999999999998},{"$f":"AC2*$AE2*$AG2/1000","v":10.31855},null,null,{"$f":"I2-J2","v":27.203449999999997},{"$f":"K2-L2","v":0},"No",null,null,null,null,null,null,null,{"$f":"IF(ISBLANK(P2),1,sHDD/P2)","v":1},{"$f":"IF(ISBLANK(Q2),1,sCDD/Q2)","v":1},null,"Base Watt",40,"Upgrade Watt",11,"Residential hours per day",2.57,"Days per year",365]
["Residential","Lighting Upgrade","15W CFL replaces 60W Incandescent","Mini Spiral CFL - 15 W","Incandescent 60 W","bulbs",{"$f":"10000/(AE3*AG3)","v":10.660412557965994},0,56.282999999999994,14.070749999999999,null,null,42.212249999999997,0,"No",null,null,null,null,null,null,null,{"$f":"IF(ISBLANK(P3),1,sHDD/P3)","v":1},{"$f":"IF(ISBLANK(Q3),1,sCDD/Q3)","v":1},null,"Base Watt",60,"Upgrade Watt",15,"Residential hours per day",2.57,"Days per year",365]
["Residential","Lighting Upgrade","20W CFL replaces 100W Incandescent","Mini Spiral CFL - 20 W","Incandescent 100 W","bulbs",{"$f":"10000/(AE4*AG4)","v":10.660412557965994},0,93.805000000000007,18.760999999999999,null,null,75.044000000000011,0,"No",null,null,null,null,null,null,null,{"$f":"IF(ISBLANK(P4),1,sHDD/P4)","v":1},{"$f":"IF(ISBLANK(Q4),1,sCDD/Q4)","v":1},null,"Base Watt",100,"Upgrade Watt",20,"Residential hours per day",2.57,"Days per year",365]
["Residential","Water Heating","Condensing Gas Storage water heater (0.8 Energy Factor)","Condensing gas water heater with energy factor of 0.80","Conventional water heater with Energy Factor of 0.6","water heater",13,5.0000000000000001E-3,null,null,{"$f":"AE5*AG5*(AI5-AK5)*AM5/100000/AA5","v":180.01650625000002},{"$f":"AE5*AG5*(AI5-AK5)*AM5/100000/AC5","v":135.01237968749999},0,45.004126562500034,"No",null,null,null,null,null,null,null,{"$f":"IF(ISBLANK(P5),1,sHDD/P5)","v":1},{"$f":"IF(ISBLANK(Q5),1,sCDD/Q5)","v":1},null,"EF base",0.6,"EF upgrade",0.8,"gallons per year",{"$f":"50*365.25","v":18262.5},"specific heat of water",8.33,"tank temp (degF)",125,"inlet temp",54,"heat capacity of water",1]
["Residential","Water Heating","Heat pump water heater (2 Energy Factor)","Heat Pump Water Heater - Estar EF2.0","Electric Water Heater","50 gallon water heater",13,5.0000000000000001E-3,1918.963368972341,null,null,null,1918.963368972341,{"$f":"K6-L6","v":0},"No",null,null,null,null,null,null,null,1,1,"From ComEd Residential. Assumes not heating/cooling impacts"]
["Residential","Water Heating","Heat pump water heater (2.35 Energy Factor)","Heat Pump Water Heater - EF2.35","Electric Water Heater","50 gallon water heater",13,5.0000000000000001E-3,2154.6987354666921,null,null,null,2154.6987354666921,0,"No",null,null,null,null,null,null,null,1,1,"From ComEd Residential. Assumes not heating/cooling impacts"]
["Residential","Water Heating","Kitchen Low Flow Aerators (direct install, electric water heater)","2.2 GPM or less","2.75 GPM or more","faucet",9,0,44.976752281857088,null,null,null,44.976752281857088,0,"No",null,null,null,null,null,null,null,1,1,"From ComEd Residential. Assumes not heating/cooling impacts"]
["Residential","Water Heating","Kitchen Low Flow Aerators (direct install, gas water heater)","2.2 GPM or less","2.75 GPM or more","faucet",9,0,null,null,1.89,null,0,1.89,"No",null,null,null,null,null,null,null,{"$f":"IF(ISBLANK(P9),1,sHDD/P9)","v":1},1,"Illinois TRM"]
["Residential","Water Heating","Low flow shower head (direct install, electric water heater)","1.5 GPM","2.5 GPM","Showerhead",10,0,468,null,null,null,468,0,"No",null,null,null,null,null,null,null,1,1,"Illinois TRM"]
["Residential","Water Heating","Low flow shower head (direct install, gas water heater)","1.5 GPM","2.5 GPM","Showerhead",10,0,0,null,19.899999999999999,null,0,19.899999999999999,"No",null,null,null,null,null,null,null,1,1,"Illinois TRM"]
["Residential","Water Heating","Water Heater Temp Setback (electric)","120 degrees","≥ 130 degrees","Water heater",2,5.0000000000000001E-3,86.4,null,null,null,86.4,0,"No",null,null,null,null,null,null,null,1,1,"Illinois TRM. Assumes dishwasher supplemental heating"]
["Residential","Water Heating","Water Heater Temp Setback (gas)","120 degrees","≥ 130 degrees","Water heater",2,5.0000000000000001E-3,null,null,{"$f":"6.4-34.2*Conversions!N50","v":5.2330522240000006},null,0,{"$f":"K13-L13","v":5.2330522240000006},"No",null,null,null,null,null,null,null,1,1,"Illinois TRM. Assumes dishwasher supplemental heating"]
["Residential","HVAC",{"$f":"\"Efficient Room AC COP = \"&AC14&\" to \"&AE14","v":"Efficient Room AC COP = 2.4 to 2.8"},{"$f":"\"Room AC with coefficient of performance = \"&$AE14","v":"Room AC with coefficient of performance = 2.8"},{"$f":"\"Room AC with coefficient of performance = \"&$AC14","v":"Room AC with coefficient of performance = 2.4"},"kW of cooling capacity",12,5.0000000000000001E-3,{"$f":"$AA14*$AG14/AC14","v":87.5},{"$f":"$AA14*$AG14/AE14","v":75},null,null,12.5,0,"Yes",3474,464,{"$f":"'CDD-energy curve fit'!$D$3*Data!Q14+'CDD-energy curve fit'!$E$3","v":3183.9536000000003},{"$f":"'CDD-energy curve fit'!$D$3*sCDD+'CDD-energy curve fit'!$E$3","v":1279.8220000000001},{"$f":"S14/R14","v":0.40196000343723604},{"$f":"M14*T14","v":5.0245000429654505},{"$f":"N14","v":0},{"$f":"IF(ISBLANK(P14),1,sHDD/P14)","v":0.20293609671848015},{"$f":"IF(ISBLANK(Q14),1,sCDD/Q14)","v":6.4655172413793108E-2},"Full load hours from Illinois TRM. COP ranges based on professional judgement","Full Load Hours (Chicago)",210,"Base COP",2.4,"Upgrade COP",2.8,"Capacity (kW)",1]
["Residential","HVAC",{"$f":"\"Efficient Room AC COP = \"&AC15&\" to \"&AE15","v":"Efficient Room AC COP = 2.4 to 3.2"},{"$f":"\"Room AC with coefficient of performance = \"&$AE15","v":"Room AC with coefficient of performance = 3.2"},{"$f":"\"Room AC with coefficient of performance = \"&$AC15","v":"Room AC with coefficient of performance = 2.4"},"kW of cooling capacity",12,5.0000000000000001E-3,{"$f":"$AA15*$AG15/AC15","v":87.5},{"$f":"$AA15*$AG15/AE15","v":65.625},null,null,21.875,0,"Yes",3474,464,{"$f":"'CDD-energy curve fit'!$D$3*Data!Q15+'CDD-energy curve fit'!$E$3","v":3183.9536000000003},{"$f":"'CDD-energy curve fit'!$D$3*sCDD+'CDD-energy curve fit'!$E$3","v":1279.8220000000001},{"$f":"S15/R15","v":0.40196000343723604},{"$f":"M15*T15","v":8.7928750751895386},0,0.20293609671848015,{"$f":"IF(ISBLANK(Q15),1,sCDD/Q15)","v":6.4655172413793108E-2},"Full load hours from Illinois TRM. COP ranges based on professional judgement","Full Load Hours (Chicago)",210,"Base COP",2.4,"Upgrade COP",3.2,"Capacity (kW)",1]
["Residential","HVAC",{"$f":"\"Efficient Room AC COP = \"&AC16&\" to \"&AE16","v":"Efficient Room AC COP = 2.4 to 3.6"},"Room AC with coefficient of performance = 3.6","Room AC with coefficient of performance = 2.4","kW of cooling capacity",12,5.0000000000000001E-3,87.5,58.333333333333329,null,null,29.166666666666671,0,"Yes",3474,464,{"$f":"'CDD-energy curve fit'!$D$3*Data!Q16+'CDD-energy curve fit'!$E$3","v":3183.9536000000003},{"$f":"'CDD-energy curve fit'!$D$3*sCDD+'CDD-energy curve fit'!$E$3","v":1279.8220000000001},0.40196000343723604,11.723833433586053,0,0.20293609671848015,{"$f":"IF(ISBLANK(Q16),1,sCDD/Q16)","v":6.4655172413793108E-2},"Full load hours from Illinois TRM. COP ranges based on professional judgement","Full Load Hours (Chicago)",210,"Base COP",2.4,"Upgrade COP",3.6,"Capacity (kW)",1]
["Residential","HVAC","Efficient Room AC COP = 2.4 to 4","Room AC with coefficient of performance = 4","Room AC with coefficient of performance = 2.4","kW of cooling capacity",12,5.0000000000000001E-3,87.5,52.5,null,null,35,0,"Yes",3474,464,{"$f":"'CDD-energy curve fit'!$D$3*Data!Q17+'CDD-energy curve fit'!$E$3","v":3183.9536000000003},{"$f":"'CDD-energy curve fit'!$D$3*sCDD+'CDD-energy curve fit'!$E$3","v":1279.8220000000001},0.40196000343723604,14.068600120303261,0,0.20293609671848015,6.4655172413793108E-2,"Full load hours from Illinois TRM. COP ranges based on professional judgement","Full Load Hours (Chicago)",210,"Base COP",2.4,"Upgrade COP",4,"Capacity (kW)",1]
["Residential","HVAC",{"$f":"\"Efficient Room AC COP = \"&AC18&\" to \"&AE18","v":"Efficient Room AC COP = 2.4 to 4.4"},"Room AC with coefficient of performance = 4.4","Room AC with coefficient of performance = 2.4","kW of cooling capacity",12,5.0000000000000001E-3,87.5,47.727272727272727,null,null,39.772727272727273,0,"Yes",3474,464,{"$f":"'CDD-energy curve fit'!$D$3*Data!Q18+'CDD-energy curve fit'!$E$3","v":3183.9536000000003},{"$f":"'CDD-energy curve fit'!$D$3*sCDD+'CDD-energy curve fit'!$E$3","v":1279.8220000000001},0.40196000343723604,15.987045591253706,0,0.20293609671848015,6.4655172413793108E-2,"Full load hours from Illinois TRM. COP ranges based on professional judgement","Full Load Hours (Chicago)",210,"Base COP",2.4,"Upgrade COP",4.4000000000000004,"Capacity (kW)",1]
["Residential","HVAC",{"$f":"\"Efficient Room AC COP = \"&AC19&\" to \"&AE19","v":"Efficient Room AC COP = 2.8 to 3.2"},"Room AC with coefficient of performance = 3.2","Room AC with coefficient of performance = 2.8","kW of cooling capacity",12,5.0000000000000001E-3,75,65.625,null,null,9.375,0,"Yes",3474,464,{"$f":"'CDD-energy curve fit'!$D$3*Data!Q19+'CDD-energy curve fit'!$E$3","v":3183.9536000000003},{"$f":"'CDD-energy curve fit'!$D$3*sCDD+'CDD-energy curve fit'!$E$3","v":1279.8220000000001},0.40196000343723604,3.7683750322240877,0,0.20293609671848015,6.4655172413793108E-2,"Full load hours from Illinois TRM. COP ranges based on professional judgement","Full Load Hours (Chicago)",210,"Base COP",2.8,"Upgrade COP",3.2,"Capacity (kW)",1]
["Residential","HVAC",{"$f":"\"Efficient Room AC COP = \"&AC20&\" to \"&AE20","v":"Efficient Room AC COP = 2.8 to 3.6"},"Room AC with coefficient of performance = 3.6","Room AC with coefficient of performance = 2.8","kW of cooling capacity",12,5.0000000000000001E-3,{"$f":"$AA20*$AG20/AC20","v":75},{"$f":"$AA20*$AG20/AE20","v":58.333333333333329},null,null,16.666666666666671,0,"Yes",3474,464,{"$f":"'CDD-energy curve fit'!$D$3*Data!Q20+'CDD-energy curve fit'!$E$3","v":3183.9536000000003},{"$f":"'CDD-energy curve fit'!$D$3*sCDD+'CDD-energy curve fit'!$E$3","v":1279.8220000000001},0.40196000343723604,6.6993333906206027,0,0.20293609671848015,6.4655172413793108E-2,"Full load hours from Illinois TRM. COP ranges based on professional judgement","Full Load Hours (Chicago)",210,"Base COP",2.8,"Upgrade COP",3.6,"Capacity (kW)",1]
["Residential","HVAC","Efficient Room AC COP = 2.8 to 4","Room AC with coefficient of performance = 4","Room AC with coefficient of performance = 2.8","kW of cooling capacity",12,5.0000000000000001E-3,75,52.5,null,null,22.5,0,"Yes",3474,464,{"$f":"'CDD-energy curve fit'!$D$3*Data!Q21+'CDD-energy curve fit'!$E$3","v":3183.9536000000003},{"$f":"'CDD-energy curve fit'!$D$3*sCDD+'CDD-energy curve fit'!$E$3","v":1279.8220000000001},0.40196000343723604,9.0441000773378111,0,0.20293609671848015,6.4655172413793108E-2,"Full load hours from Illinois TRM. COP ranges based on professional judgement","Full Load Hours (Chicago)",210,"Base COP",2.8,"Upgrade COP",4,"Capacity (kW)",1]
["Residential","HVAC",{"$f":"\"Efficient Room AC COP = \"&AC22&\" to \"&AE22","v":"Efficient Room AC COP = 2.8 to 4.4"},"Room AC with coefficient of performance = 4.4","Room AC with coefficient of performance = 2.8","kW of cooling capacity",12,5.0000000000000001E-3,{"$f":"$AA22*$AG22/AC22","v":75},{"$f":"$AA22*$AG22/AE22","v":47.727272727272727},null,null,27.272727272727273,0,"Yes",3474,464,{"$f":"'CDD-energy curve fit'!$D$3*Data!Q22+'CDD-energy curve fit'!$E$3","v":3183.9536000000003},{"$f":"'CDD-energy curve fit'!$D$3*sCDD+'CDD-energy curve fit'!$E$3","v":1279.8220000000001},0.40196000343723604,10.962545548288256,0,0.20293609671848015,6.4655172413793108E-2,"Full load hours from Illinois TRM. COP ranges based on professional judgement","Full Load Hours (Chicago)",210,"Base COP",2.8,"Upgrade COP",4.4000000000000004,"Capacity (kW)",1]
["Residential","HVAC",{"$f":"\"Efficient Room AC COP = \"&AC23&\" to \"&AE23","v":"Efficient Room AC COP = 3 to 3.2"},"Room AC with coefficient of performance = 3.2","Room AC with coefficient of performance = 3","kW of cooling capacity",12,5.0000000000000001E-3,{"$f":"$AA23*$AG23/AC23","v":70},{"$f":"$AA23*$AG23/AE23","v":65.625},null,null,4.375,0,"Yes",3474,464,{"$f":"'CDD-energy curve fit'!$D$3*Data!Q23+'CDD-energy curve fit'!$E$3","v":3183.9536000000003},{"$f":"'CDD-energy curve fit'!$D$3*sCDD+'CDD-energy curve fit'!$E$3","v":1279.8220000000001},0.40196000343723604,1.7585750150379076,0,0.20293609671848015,6.4655172413793108E-2,"Full load hours from Illinois TRM. COP ranges based on professional judgement","Full Load Hours (Chicago)",210,"Base COP",3,"Upgrade COP",3.2,"Capacity (kW)",1]
["Residential","HVAC","Efficient Room AC COP = 3 to 3.6","Room AC with coefficient of performance = 3.6","Room AC with coefficient of performance = 3","kW of cooling capacity",12,5.0000000000000001E-3,70,58.333333333333329,null,null,11.666666666666671,0,"Yes",3474,464,{"$f":"'CDD-energy curve fit'!$D$3*Data!Q24+'CDD-energy curve fit'!$E$3","v":3183.9536000000003},{"$f":"'CDD-energy curve fit'!$D$3*sCDD+'CDD-energy curve fit'!$E$3","v":1279.8220000000001},0.40196000343723604,4.689533373434422,0,0.20293609671848015,6.4655172413793108E-2,"Full load hours from Illinois TRM. COP ranges based on professional judgement","Full Load Hours (Chicago)",210,"Base COP",3,"Upgrade COP",3.6,"Capacity (kW)",1]
["Residential","HVAC",{"$f":"\"Efficient Room AC COP = \"&AC25&\" to \"&AE25","v":"Efficient Room AC COP = 3 to 4"},"Room AC with coefficient of performance = 4","Room AC with coefficient of performance = 3","kW of cooling capacity",12,5.0000000000000001E-3,{"$f":"$AA25*$AG25/AC25","v":70},{"$f":"$AA25*$AG25/AE25","v":52.5},null,null,17.5,0,"Yes",3474,464,{"$f":"'CDD-energy curve fit'!$D$3*Data!Q25+'CDD-energy curve fit'!$E$3","v":3183.9536000000003},{"$f":"'CDD-energy curve fit'!$D$3*sCDD+'CDD-energy curve fit'!$E$3","v":1279.8220000000001},0.40196000343723604,7.0343000601516303,0,0.20293609671848015,6.4655172413793108E-2,"Full load hours from Illinois TRM. COP ranges based on professional judgement","Full Load Hours (Chicago)",210,"Base COP",3,"Upgrade COP",4,"Capacity (kW)",1]
["Residential","HVAC",{"$f":"\"Efficient Room AC COP = \"&AC26&\" to \"&AE26","v":"Efficient Room AC COP = 3 to 4.4"},"Room AC with coefficient of performance = 4.4","Room AC with coefficient of performance = 3","kW of cooling capacity",12,5.0000000000000001E-3,{"$f":"$AA26*$AG26/AC26","v":70},{"$f":"$AA26*$AG26/AE26","v":47.727272727272727},null,null,22.272727272727273,0,"Yes",3474,464,{"$f":"'CDD-energy curve fit'!$D$3*Data!Q26+'CDD-energy curve fit'!$E$3","v":3183.9536000000003},{"$f":"'CDD-energy curve fit'!$D$3*sCDD+'CDD-energy curve fit'!$E$3","v":1279.8220000000001},0.40196000343723604,8.9527455311020763,0,0.20293609671848015,6.4655172413793108E-2,"Full load hours from Illinois TRM. COP ranges based on professional judgement","Full Load Hours (Chicago)",210,"Base COP",3,"Upgrade COP",4.4000000000000004,"Capacity (kW)",1]
["Residential","HVAC","Efficient Room AC COP = 3.2 to 3.6","Room AC with coefficient of performance = 3.6","Room AC with coefficient of performance = 3.2","kW of cooling capacity",12,5.0000000000000001E-3,65.625,58.333333333333329,null,null,7.2916666666666714,0,"Yes",3474,464,{"$f":"'CDD-energy curve fit'!$D$3*Data!Q27+'CDD-energy curve fit'!$E$3","v":3183.9536000000003},{"$f":"'CDD-energy curve fit'!$D$3*sCDD+'CDD-energy curve fit'!$E$3","v":1279.8220000000001},0.40196000343723604,2.9309583583965146,0,0.20293609671848015,6.4655172413793108E-2,"Full load hours from Illinois TRM. COP ranges based on professional judgement","Full Load Hours (Chicago)",210,"Base COP",3.2,"Upgrade COP",3.6,"Capacity (kW)",1]
["Residential","HVAC","Efficient Room AC COP = 3.2 to 4","Room AC with coefficient of performance = 4","Room AC with coefficient of performance = 3.2","kW of cooling capacity",12,5.0000000000000001E-3,65.625,52.5,null,null,13.125,0,"Yes",3474,464,{"$f":"'CDD-energy curve fit'!$D$3*Data!Q28+'CDD-energy curve fit'!$E$3","v":3183.9536000000003},{"$f":"'CDD-energy curve fit'!$D$3*sCDD+'CDD-energy curve fit'!$E$3","v":1279.8220000000001},0.40196000343723604,5.275725045113723,0,0.20293609671848015,6.4655172413793108E-2,"Full load hours from Illinois TRM. COP ranges based on professional judgement","Full Load Hours (Chicago)",210,"Base COP",3.2,"Upgrade COP",4,"Capacity (kW)",1]
["Residential","HVAC",{"$f":"\"Efficient Room AC COP = \"&AC29&\" to \"&AE29","v":"Efficient Room AC COP = 3.2 to 4.4"},"Room AC with coefficient of performance = 4.4","Room AC with coefficient of performance = 3.2","kW of cooling capacity",12,5.0000000000000001E-3,{"$f":"$AA29*$AG29/AC29","v":65.625},{"$f":"$AA29*$AG29/AE29","v":47.727272727272727},null,null,17.897727272727273,0,"Yes",3474,464,{"$f":"'CDD-energy curve fit'!$D$3*Data!Q29+'CDD-energy curve fit'!$E$3","v":3183.9536000000003},{"$f":"'CDD-energy curve fit'!$D$3*sCDD+'CDD-energy curve fit'!$E$3","v":1279.8220000000001},0.40196000343723604,7.194170516064168,0,0.20293609671848015,6.4655172413793108E-2,"Full load hours from Illinois TRM. COP ranges based on professional judgement","Full Load Hours (Chicago)",210,"Base COP",3.2,"Upgrade COP",4.4000000000000004,"Capacity (kW)",1]
["Residential","HVAC",{"$f":"\"Efficient Central AC COP = \"&AC30&\" to \"&AE30","v":"Efficient Central AC COP = 2.4 to 2.8"},{"$f":"\"Central AC with coefficient of performance = \"&$AE30","v":"Central AC with coefficient of performance = 2.8"},{"$f":"\"Central AC with coefficient of performance = \"&$AC30","v":"Central AC with coefficient of performance = 2.4"},"kW of cooling capacity",18,5.0000000000000001E-3,237.5,203.57142857142858,null,null,33.928571428571416,0,"Yes",3474,464,{"$f":"'CDD-energy curve fit'!$D$3*Data!Q30+'CDD-energy curve fit'!$E$3","v":3183.9536000000003},{"$f":"'CDD-energy curve fit'!$D$3*sCDD+'CDD-energy curve fit'!$E$3","v":1279.8220000000001},0.40196000343723604,13.637928688049074,0,0.20293609671848015,6.4655172413793108E-2,"Full load hours from Illinois TRM. COP ranges based on professional judgement","Full Load Hours (Chicago)",570,"Base COP",2.4,"Upgrade COP",2.8,"Capacity (kW)",1]
["Residential","HVAC",{"$f":"\"Efficient Central AC COP = \"&AC31&\" to \"&AE31","v":"Efficient Central AC COP = 2.4 to 3.2"},{"$f":"\"Central AC with coefficient of performance = \"&$AE31","v":"Central AC with coefficient of performance = 3.2"},{"$f":"\"Central AC with coefficient of performance = \"&$AC31","v":"Central AC with coefficient of performance = 2.4"},"kW of cooling capacity",18,5.0000000000000001E-3,237.5,178.125,null,null,59.375,0,"Yes",3474,464,{"$f":"'CDD-energy curve fit'!$D$3*Data!Q31+'CDD-energy curve fit'!$E$3","v":3183.9536000000003},{"$f":"'CDD-energy curve fit'!$D$3*sCDD+'CDD-energy curve fit'!$E$3","v":1279.8220000000001},0.40196000343723604,23.866375204085891,0,0.20293609671848015,6.4655172413793108E-2,"Full load hours from Illinois TRM. COP ranges based on professional judgement","Full Load Hours (Chicago)",570,"Base COP",2.4,"Upgrade COP",3.2,"Capacity (kW)",1]
["Residential","HVAC","Efficient Central AC COP = 2.4 to 3.6","Central AC with coefficient of performance = 3.6","Central AC with coefficient of performance = 2.4","kW of cooling capacity",18,5.0000000000000001E-3,237.5,158.33333333333334,null,null,79.166666666666657,0,"Yes",3474,464,{"$f":"'CDD-energy curve fit'!$D$3*Data!Q32+'CDD-energy curve fit'!$E$3","v":3183.9536000000003},{"$f":"'CDD-energy curve fit'!$D$3*sCDD+'CDD-energy curve fit'!$E$3","v":1279.8220000000001},0.40196000343723604,31.82183360544785,0,0.20293609671848015,6.4655172413793108E-2,"Full load hours from Illinois TRM. COP ranges based on professional judgement","Full Load Hours (Chicago)",570,"Base COP",2.4,"Upgrade COP",3.6,"Capacity (kW)",1]
["Residential","HVAC","Efficient Central AC COP = 2.4 to 4","Central AC with coefficient of performance = 4","Central AC with coefficient of performance = 2.4","kW of cooling capacity",18,5.0000000000000001E-3,237.5,142.5,null,null,95,0,"Yes",3474,464,{"$f":"'CDD-energy curve fit'!$D$3*Data!Q33+'CDD-energy curve fit'!$E$3","v":3183.9536000000003},{"$f":"'CDD-energy curve fit'!$D$3*sCDD+'CDD-energy curve fit'!$E$3","v":1279.8220000000001},0.40196000343723604,38.186200326537424,0,0.20293609671848015,6.4655172413793108E-2,"Full load hours from Illinois TRM. COP ranges based on professional judgement","Full Load Hours (Chicago)",570,"Base COP",2.4,"Upgrade COP",4,"Capacity (kW)",1]
["Residential","HVAC","Efficient Central AC COP = 2.4 to 4.4","Central AC with coefficient of performance = 4.4","Central AC with coefficient of performance = 2.4","kW of cooling capacity",18,5.0000000000000001E-3,237.5,129.54545454545453,null,null,{"$f":"I34-J34","v":107.95454545454547},0,"Yes",3474,464,{"$f":"'CDD-energy curve fit'!$D$3*Data!Q34+'CDD-energy curve fit'!$E$3","v":3183.9536000000003},{"$f":"'CDD-energy curve fit'!$D$3*sCDD+'CDD-energy curve fit'!$E$3","v":1279.8220000000001},0.40196000343723604,43.39340946197435,0,0.20293609671848015,6.4655172413793108E-2,"Full load hours from Illinois TRM. COP ranges based on professional judgement","Full Load Hours (Chicago)",570,"Base COP",2.4,"Upgrade COP",4.4000000000000004,"Capacity (kW)",1]
["Residential","HVAC","Efficient Central AC COP = 2.8 to 3.2","Central AC with coefficient of performance = 3.2","Central AC with coefficient of performance = 2.8","kW of cooling capacity",18,5.0000000000000001E-3,203.57142857142858,178.125,null,null,25.446428571428584,0,"Yes",3474,464,{"$f":"'CDD-energy curve fit'!$D$3*Data!Q35+'CDD-energy curve fit'!$E$3","v":3183.9536000000003},{"$f":"'CDD-energy curve fit'!$D$3*sCDD+'CDD-energy curve fit'!$E$3","v":1279.8220000000001},0.40196000343723604,10.228446516036815,0,0.20293609671848015,6.4655172413793108E-2,"Full load hours from Illinois TRM. COP ranges based on professional judgement","Full Load Hours (Chicago)",570,"Base COP",2.8,"Upgrade COP",3.2,"Capacity (kW)",1]
["Residential","HVAC","Efficient Central AC COP = 2.8 to 3.6","Central AC with coefficient of performance = 3.6","Central AC with coefficient of performance = 2.8","kW of cooling capacity",18,5.0000000000000001E-3,{"$f":"$AA36*$AG36/AC36","v":203.57142857142858},{"$f":"$AA36*$AG36/AE36","v":158.33333333333334},null,null,45.238095238095241,0,"Yes",3474,464,{"$f":"'CDD-energy curve fit'!$D$3*Data!Q36+'CDD-energy curve fit'!$E$3","v":3183.9536000000003},{"$f":"'CDD-energy curve fit'!$D$3*sCDD+'CDD-energy curve fit'!$E$3","v":1279.8220000000001},0.40196000343723604,18.183904917398774,0,0.20293609671848015,6.4655172413793108E-2,"Full load hours from Illinois TRM. COP ranges based on professional judgement","Full Load Hours (Chicago)",570,"Base COP",2.8,"Upgrade COP",3.6,"Capacity (kW)",1]
["Residential","HVAC","Efficient Central AC COP = 2.8 to 4","Central AC with coefficient of performance = 4","Central AC with coefficient of performance = 2.8","kW of cooling capacity",18,5.0000000000000001E-3,203.57142857142858,142.5,null,null,61.071428571428584,0,"Yes",3474,464,{"$f":"'CDD-energy curve fit'!$D$3*Data!Q37+'CDD-energy curve fit'!$E$3","v":3183.9536000000003},{"$f":"'CDD-energy curve fit'!$D$3*sCDD+'CDD-energy curve fit'!$E$3","v":1279.8220000000001},0.40196000343723604,24.548271638488348,0,0.20293609671848015,6.4655172413793108E-2,"Full load hours from Illinois TRM. COP ranges based on professional judgement","Full Load Hours (Chicago)",570,"Base COP",2.8,"Upgrade COP",4,"Capacity (kW)",1]
["Residential","HVAC","Efficient Central AC COP = 2.8 to 4.4","Central AC with coefficient of performance = 4.4","Central AC with coefficient of performance = 2.8","kW of cooling capacity",18,5.0000000000000001E-3,{"$f":"$AA38*$AG38/AC38","v":203.57142857142858},{"$f":"$AA38*$AG38/AE38","v":129.54545454545453},null,null,74.025974025974051,0,"Yes",3474,464,{"$f":"'CDD-energy curve fit'!$D$3*Data!Q38+'CDD-energy curve fit'!$E$3","v":3183.9536000000003},{"$f":"'CDD-energy curve fit'!$D$3*sCDD+'CDD-energy curve fit'!$E$3","v":1279.8220000000001},0.40196000343723604,29.755480773925274,0,0.20293609671848015,6.4655172413793108E-2,"Full load hours from Illinois TRM. COP ranges based on professional judgement","Full Load Hours (Chicago)",570,"Base COP",2.8,"Upgrade COP",4.4000000000000004,"Capacity (kW)",1]
["Residential","HVAC","Efficient Central AC COP = 3 to 3.2","Central AC with coefficient of performance = 3.2","Central AC with coefficient of performance = 3","kW of cooling capacity",18,5.0000000000000001E-3,{"$f":"$AA39*$AG39/AC39","v":190},{"$f":"$AA39*$AG39/AE39","v":178.125},null,null,11.875,0,"Yes",3474,464,{"$f":"'CDD-energy curve fit'!$D$3*Data!Q39+'CDD-energy curve fit'!$E$3","v":3183.9536000000003},{"$f":"'CDD-energy curve fit'!$D$3*sCDD+'CDD-energy curve fit'!$E$3","v":1279.8220000000001},0.40196000343723604,4.773275040817178,0,0.20293609671848015,6.4655172413793108E-2,"Full load hours from Illinois TRM. COP ranges based on professional judgement","Full Load Hours (Chicago)",570,"Base COP",3,"Upgrade COP",3.2,"Capacity (kW)",1]
["Residential","HVAC","Efficient Central AC COP = 3 to 3.6","Central AC with coefficient of performance = 3.6","Central AC with coefficient of performance = 3","kW of cooling capacity",18,5.0000000000000001E-3,190,158.33333333333334,null,null,31.666666666666657,0,"Yes",3474,464,{"$f":"'CDD-energy curve fit'!$D$3*Data!Q40+'CDD-energy curve fit'!$E$3","v":3183.9536000000003},{"$f":"'CDD-energy curve fit'!$D$3*sCDD+'CDD-energy curve fit'!$E$3","v":1279.8220000000001},0.40196000343723604,12.728733442179138,0,0.20293609671848015,6.4655172413793108E-2,"Full load hours from Illinois TRM. COP ranges based on professional judgement","Full Load Hours (Chicago)",570,"Base COP",3,"Upgrade COP",3.6,"Capacity (kW)",1]
["Residential","HVAC","Efficient Central AC COP = 3 to 4","Central AC with coefficient of performance = 4","Central AC with coefficient of performance = 3","kW of cooling capacity",18,5.0000000000000001E-3,{"$f":"$AA41*$AG41/AC41","v":190},{"$f":"$AA41*$AG41/AE41","v":142.5},null,null,47.5,0,"Yes",3474,464,{"$f":"'CDD-energy curve fit'!$D$3*Data!Q41+'CDD-energy curve fit'!$E$3","v":3183.9536000000003},{"$f":"'CDD-energy curve fit'!$D$3*sCDD+'CDD-energy curve fit'!$E$3","v":1279.8220000000001},0.40196000343723604,19.093100163268712,0,0.20293609671848015,6.4655172413793108E-2,"Full load hours from Illinois TRM. COP ranges based on professional judgement","Full Load Hours (Chicago)",570,"Base COP",3,"Upgrade COP",4,"Capacity (kW)",1]
["Residential","HVAC","Efficient Central AC COP = 3 to 4.4","Central AC with coefficient of performance = 4.4","Central AC with coefficient of performance = 3","kW of cooling capacity",18,5.0000000000000001E-3,{"$f":"$AA42*$AG42/AC42","v":190},{"$f":"$AA42*$AG42/AE42","v":129.54545454545453},null,null,60.454545454545467,0,"Yes",3474,464,{"$f":"'CDD-energy curve fit'!$D$3*Data!Q42+'CDD-energy curve fit'!$E$3","v":3183.9536000000003},{"$f":"'CDD-energy curve fit'!$D$3*sCDD+'CDD-energy curve fit'!$E$3","v":1279.8220000000001},0.40196000343723604,24.300309298705638,0,0.20293609671848015,6.4655172413793108E-2,"Full load hours from Illinois TRM. COP ranges based on professional judgement","Full Load Hours (Chicago)",570,"Base COP",3,"Upgrade COP",4.4000000000000004,"Capacity (kW)",1]
["Residential","HVAC","Efficient Central AC COP = 3.2 to 3.6","Central AC with coefficient of performance = 3.6","Central AC with coefficient of performance = 3.2","kW of cooling capacity",18,5.0000000000000001E-3,178.125,158.33333333333334,null,null,19.791666666666657,0,"Yes",3474,464,{"$f":"'CDD-energy curve fit'!$D$3*Data!Q43+'CDD-energy curve fit'!$E$3","v":3183.9536000000003},{"$f":"'CDD-energy curve fit'!$D$3*sCDD+'CDD-energy curve fit'!$E$3","v":1279.8220000000001},0.40196000343723604,7.9554584013619598,0,0.20293609671848015,6.4655172413793108E-2,"Full load hours from Illinois TRM. COP ranges based on professional judgement","Full Load Hours (Chicago)",570,"Base COP",3.2,"Upgrade COP",3.6,"Capacity (kW)",1]
["Residential","HVAC","Efficient Central AC COP = 3.2 to 4","Central AC with coefficient of performance = 4","Central AC with coefficient of performance = 3.2","kW of cooling capacity",18,5.0000000000000001E-3,178.125,142.5,null,null,35.625,0,"Yes",3474,464,{"$f":"'CDD-energy curve fit'!$D$3*Data!Q44+'CDD-energy curve fit'!$E$3","v":3183.9536000000003},{"$f":"'CDD-energy curve fit'!$D$3*sCDD+'CDD-energy curve fit'!$E$3","v":1279.8220000000001},0.40196000343723604,14.319825122451533,0,0.20293609671848015,6.4655172413793108E-2,"Full load hours from Illinois TRM. COP ranges based on professional judgement","Full Load Hours (Chicago)",570,"Base COP",3.2,"Upgrade COP",4,"Capacity (kW)",1]
["Residential","HVAC","Efficient Central AC COP = 3.2 to 4.4","Central AC with coefficient of performance = 4.4","Central AC with coefficient of performance = 3.2","kW of cooling capacity",18,5.0000000000000001E-3,{"$f":"$AA45*$AG45/AC45","v":178.125},{"$f":"$AA45*$AG45/AE45","v":129.54545454545453},null,null,48.579545454545467,0,"Yes",3474,464,{"$f":"'CDD-energy curve fit'!$D$3*Data!Q45+'CDD-energy curve fit'!$E$3","v":3183.9536000000003},{"$f":"'CDD-energy curve fit'!$D$3*sCDD+'CDD-energy curve fit'!$E$3","v":1279.8220000000001},0.40196000343723604,19.527034257888459,0,0.20293609671848015,6.4655172413793108E-2,"Full load hours from Illinois TRM. COP ranges based on professional judgement","Full Load Hours (Chicago)",570,"Base COP",3.2,"Upgrade COP",4.4000000000000004,"Capacity (kW)",1]
["Commercial","Lighting Upgrade","11W CFL replaces 40W Incandescent","Mini Spiral CFL - 11 W","Incandescent 40 W","bulbs",{"$f":"10000/(AE46)","v":3.1269543464665417},0,{"$f":"AA46*$AE46/1000","v":127.92},{"$f":"AC46*$AE46/1000","v":35.177999999999997},0,0,92.742000000000004,0,"No",null,null,null,null,null,null,null,{"$f":"IF(ISBLANK(P46),1,sHDD/P46)","v":1},{"$f":"IF(ISBLANK(Q46),1,sCDD/Q46)","v":1},"Illinois TRM. Miscellaneous operating hours; interactive effects excluded","Base Watt",40,"Upgrade Watt",11,"Commercial screw-based hours per hear",3198]
["Commercial","Lighting Upgrade","15W CFL replaces 60W Incandescent","Mini Spiral CFL - 15 W","Incandescent 60 W","bulbs",{"$f":"10000/(AE47)","v":3.1269543464665417},0,{"$f":"AA47*$AE47/1000","v":191.88},{"$f":"AC47*$AE47/1000","v":47.97},0,0,143.91,0,"No",null,null,null,null,null,null,null,1,1,"Illinois TRM. Miscellaneous operating hours; interactive effects excluded","Base Watt",60,"Upgrade Watt",15,"Commercial screw-based hours per hear",3198]
["Commercial","Lighting Upgrade","20W CFL replaces 100W Incandescent","Mini Spiral CFL - 20 W","Incandescent 100 W","bulbs",3.1269543464665417,0,319.8,63.96,0,0,255.84,0,"No",null,null,null,null,null,null,null,1,1,"Illinois TRM. Miscellaneous operating hours; interactive effects excluded","Base Watt",100,"Upgrade Watt",20,"Commercial screw-based hours per hear",3198]
["Commercial","Lighting Upgrade","T8 Upgrade","32 W T8 Lamp","36 W 4 Feet Lamp","lamps",15,0,164.73599999999999,146.43199999999999,0,0,18.304000000000002,0,"No",null,null,null,null,null,null,null,1,1,"Illinois TRM. Miscellaneous operating hours; interactive effects excluded; in service rate excluded","Base Watt",36,"Upgrade Watt",32,"Commercial lamp-based hours per year",4576]
["Commercial","Lighting Upgrade","High bay 200 Watt MH to HPT8","4-lamp high performance T8 w/ high ballast factor ballast","200 watt pulse start Metal-Halide","fixture",15,0,{"$f":"AA50*$AE50/1000","v":1061.6320000000001},{"$f":"AC50*$AE50/1000","v":668.096},0,0,393.53600000000006,0,"No",null,null,null,null,null,null,null,1,1,"Illinois TRM. Miscellaneous operating hours; interactive effects excluded; in service rate excluded","Base Watt",232,"Upgrade Watt",146,"Commercial lamp-based hours per year",4576]
["Commercial","Lighting Upgrade","High bay 250 watt MH to HPT8","4-lamp high performance T8 w/ high ballast factor ballast","250 watt metal halide","fixture",15,0,1349.92,668.096,0,0,681.82400000000007,0,"No",null,null,null,null,null,null,null,1,1,"Illinois TRM. Miscellaneous operating hours; interactive effects excluded; in service rate excluded","Base Watt",295,"Upgrade Watt",146,"Commercial lamp-based hours per year",4576]
["Commercial","Lighting Upgrade","High bay 320 watt MH to HPT8","6-lamp high performance T8 w/ high ballast factor ballast","320 watt pulse start metal-halide","fixture",15,0,1601.6,942.65599999999995,0,0,658.94399999999996,0,"No",null,null,null,null,null,null,null,1,1,"Illinois TRM. Miscellaneous operating hours; interactive effects excluded; in service rate excluded","Base Watt",350,"Upgrade Watt",206,"Commercial lamp-based hours per year",4576]
["Commercial","Lighting Upgrade","High bay 400 watt MH to HPT8","6-lamp high performance T8 w/ high ballast factor ballast","400 watt pulse start metal-halide","fixture",15,0,2082.08,942.65599999999995,0,0,1139.424,0,"No",null,null,null,null,null,null,null,1,1,"Illinois TRM. Miscellaneous operating hours; interactive effects excluded; in service rate excluded","Base Watt",455,"Upgrade Watt",206,"Commercial lamp-based hours per year",4576]
["Commercial","Lighting Upgrade","T12 linear fluorscent to HPT8 - 34W T12 (1-lamp)","1-lamp high performance T8","F34T12 w/ efficient magnetic ballast","fixture",15,0,183.04,114.4,0,0,68.639999999999986,0,"No",null,null,null,null,null,null,null,1,1,"Illinois TRM. Miscellaneous operating hours; interactive effects excluded; in service rate excluded","Base Watt",40,"Upgrade Watt",25,"Commercial lamp-based hours per year",4576]
["Commercial","Lighting Upgrade","T12 linear fluorscent to HPT8 - 34W T12 (2-lamp)","2-lamp high performance T8","F34T12 w/ efficient magnetic ballast","fixture",15,0,311.16800000000001,224.22399999999999,0,0,86.944000000000017,0,"No",null,null,null,null,null,null,null,1,1,"Illinois TRM. Miscellaneous operating hours; interactive effects excluded; in service rate excluded","Base Watt",68,"Upgrade Watt",49,"Commercial lamp-based hours per year",4576]
["Commercial","Lighting Upgrade","T12 linear fluorscent to HPT8 - 34W T12 (3-lamp)","3-lamp high performance T8","F34T12 w/ efficient magnetic ballast","fixture",15,0,503.36,329.47199999999998,0,0,173.88800000000003,0,"No",null,null,null,null,null,null,null,1,1,"Illinois TRM. Miscellaneous operating hours; interactive effects excluded; in service rate excluded","Base Watt",110,"Upgrade Watt",72,"Commercial lamp-based hours per year",4576]
["Commercial","Lighting Upgrade","T12 linear fluorscent to HPT8 - 34W T12 (4-lamp)","4-lamp high performance T8","F34T12 w/ efficient magnetic ballast","fixture",15,0,636.06399999999996,430.14400000000001,0,0,205.91999999999996,0,"No",null,null,null,null,null,null,null,1,1,"Illinois TRM. Miscellaneous operating hours; interactive effects excluded; in service rate excluded","Base Watt",139,"Upgrade Watt",94,"Commercial lamp-based hours per year",4576]
["Commercial","Lighting Upgrade","T12 linear fluorscent to HPT8 - 40W T12 (1-lamp)","1-lamp high performance T8","F40T12 w/ efficient magnetic ballast","fixture",15,0,219.648,114.4,0,0,105.24799999999999,0,"No",null,null,null,null,null,null,null,1,1,"Illinois TRM. Miscellaneous operating hours; interactive effects excluded; in service rate excluded","Base Watt",48,"Upgrade Watt",25,"Commercial lamp-based hours per year",4576]
["Commercial","Lighting Upgrade","T12 linear fluorscent to HPT8 - 40W T12 (2-lamp)","2-lamp high performance T8","F40T12 w/ efficient magnetic ballast","fixture",15,0,375.23200000000003,224.22399999999999,0,0,151.00800000000004,0,"No",null,null,null,null,null,null,null,1,1,"Illinois TRM. Miscellaneous operating hours; interactive effects excluded; in service rate excluded","Base Watt",82,"Upgrade Watt",49,"Commercial lamp-based hours per year",4576]
["Commercial","Lighting Upgrade","T12 linear fluorscent to HPT8 - 40W T12 (3-lamp)","3-lamp high performance T8","F40T12 w/ efficient magnetic ballast","fixture",15,0,558.27200000000005,329.47199999999998,0,0,228.80000000000007,0,"No",null,null,null,null,null,null,null,1,1,"Illinois TRM. Miscellaneous operating hours; interactive effects excluded; in service rate excluded","Base Watt",122,"Upgrade Watt",72,"Commercial lamp-based hours per year",4576]
["Commercial","Lighting Upgrade","T12 linear fluorscent to HPT8 - 40W T12 (4-lamp)","4-lamp high performance T8","F40T12 w/ efficient magnetic ballast","fixture",15,0,750.46400000000006,430.14400000000001,0,0,320.32000000000005,0,"No",null,null,null,null,null,null,null,1,1,"Illinois TRM. Miscellaneous operating hours; interactive effects excluded; in service rate excluded","Base Watt",164,"Upgrade Watt",94,"Commercial lamp-based hours per year",4576]
["Commercial","Lighting Upgrade","T12 linear fluorscent to HPT8 - 40W T12/standard ballast (1-lamp)","1-lamp high performance T8","F40T12 w/ standard magnetic ballast","fixture",15,0,260.83199999999999,114.4,0,0,146.43199999999999,0,"No",null,null,null,null,null,null,null,1,1,"Illinois TRM. Miscellaneous operating hours; interactive effects excluded; in service rate excluded","Base Watt",57,"Upgrade Watt",25,"Commercial lamp-based hours per year",4576]
["Commercial","Lighting Upgrade","T12 linear fluorscent to HPT8 - 40W T12/standard ballast (2-lamp)","2-lamp high performance T8","F40T12 w/ standard magnetic ballast","fixture",15,0,430.14400000000001,224.22399999999999,0,0,205.92000000000002,0,"No",null,null,null,null,null,null,null,1,1,"Illinois TRM. Miscellaneous operating hours; interactive effects excluded; in service rate excluded","Base Watt",94,"Upgrade Watt",49,"Commercial lamp-based hours per year",4576]
["Commercial","Lighting Upgrade","T12 linear fluorscent to HPT8 - 40W T12/standard ballast (3-lamp)","3-lamp high performance T8","F40T12 w/ standard magnetic ballast","fixture",15,0,672.67200000000003,329.47199999999998,0,0,343.20000000000005,0,"No",null,null,null,null,null,null,null,1,1,"Illinois TRM. Miscellaneous operating hours; interactive effects excluded; in service rate excluded","Base Watt",147,"Upgrade Watt",72,"Commercial lamp-based hours per year",4576]
["Commercial","Lighting Upgrade","T12 linear fluorscent to HPT8 - 40W T12/standard ballast (4-lamp)","4-lamp high performance T8","F40T12 w/ standard magnetic ballast","fixture",15,0,832.83199999999999,430.14400000000001,0,0,402.68799999999999,0,"No",null,null,null,null,null,null,null,1,1,"Illinois TRM. Miscellaneous operating hours; interactive effects excluded; in service rate excluded","Base Watt",182,"Upgrade Watt",94,"Commercial lamp-based hours per year",4576]
["Commercial","Lighting Upgrade","T8 to HPT8 upgrade (1-lamp)","1-lamp high performance T8","Standard T8 (1-lamp)","fixture",{"$f":"24000/AE66","v":5.244755244755245},0,146.43199999999999,114.4,0,0,{"$f":"I66-J66","v":32.031999999999982},0,"No",null,null,null,null,null,null,null,1,1,"Illinois TRM. Miscellaneous operating hours; interactive effects excluded; in service rate excluded","Base Watt",32,"Upgrade Watt",25,"Commercial lamp-based hours per year",4576]
["Commercial","Lighting Upgrade","T8 to HPT8 upgrade (2-lamp)","2-lamp high performance T8","Standard T8 (2-lamp)","fixture",{"$f":"24000/AE67","v":5.244755244755245},0,269.98399999999998,224.22399999999999,0,0,45.759999999999991,0,"No",null,null,null,null,null,null,null,1,1,"Illinois TRM. Miscellaneous operating hours; interactive effects excluded; in service rate excluded","Base Watt",59,"Upgrade Watt",49,"Commercial lamp-based hours per year",4576]
["Commercial","Lighting Upgrade","T8 to HPT8 upgrade (3-lamp)","3-lamp high performance T8","Standard T8 (3-lamp)","fixture",5.244755244755245,0,402.68799999999999,329.47199999999998,0,0,73.216000000000008,0,"No",null,null,null,null,null,null,null,1,1,"Illinois TRM. Miscellaneous operating hours; interactive effects excluded; in service rate excluded","Base Watt",88,"Upgrade Watt",72,"Commercial lamp-based hours per year",4576]
["Commercial","Lighting Upgrade","T8 to HPT8 upgrade (4-lamp)","4-lamp high performance T8","Standard T8 (4-lamp)","fixture",5.244755244755245,0,521.66399999999999,430.14400000000001,0,0,91.519999999999982,0,"No",null,null,null,null,null,null,null,1,1,"Illinois TRM. Miscellaneous operating hours; interactive effects excluded; in service rate excluded","Base Watt",114,"Upgrade Watt",94,"Commercial lamp-based hours per year",4576]
["Commercial","Lighting Upgrade","Wall mounted occupancy sensor","Occupancy sensor controlling 350 watts of lighting","Lighting without controls","sensor",8,0,{"$f":"AC70*AE70","v":1601.6},{"$f":"(1-AA70)*AC70*AE70","v":944.94400000000007},0,0,656.65599999999984,0,"No",null,null,null,null,null,null,null,1,1,null,"Energy Savings Factor",0.41,"kW controlled",0.35,"Commercial lamp-based hours per year",4576]
["Commercial","Lighting Upgrade","Fixture mounted occupancy sensor","Occupancy sensor controlling 73 watts of lighting","Lighting without controls","sensor",8,0,{"$f":"AC71*AE71","v":334.048},{"$f":"(1-AA71)*AC71*AE71","v":233.83359999999996},0,0,100.21440000000004,0,"No",null,null,null,null,null,null,null,1,1,null,"Energy Savings Factor",0.3,"kW controlled",7.2999999999999995E-2,"Commercial lamp-based hours per year",4576]
["Commercial","Refrigeration","Automatic Door Closer - Walk-in Refrigerator","Automatic hydraulic door closer","No automatic closer","Refrigerator door",8,0,943,null,null,null,943,null,"No",null,null,null,null,null,null,null,1,1]
["Commercial","Refrigeration","Automatic Door Closer - Walk-in Freezer","Automatic hydraulic door closer","No automatic closer","Freezer door",8,0,2307,null,null,null,2307,null,"No",null,null,null,null,null,null,null,1,1]
["Commercial","Refrigeration","Door heater controls - Reach-in Refrigerator","Controls turn off door heaters when humidity is low","Door heaters (to prevent condensation) constantly on","Refrigerator door",12,0,{"$f":"AA74*AC74*AE74*8760","v":540.77232000000004},null,null,null,540.77232000000004,null,"No",null,null,null,null,null,null,null,1,1,null,"kWbase",9.1999999999999998E-2,"Energy Savings Factor (assume humidity sensor)",0.55000000000000004,"Bonus Factor (medium temp)",1.22]
["Commercial","Refrigeration","Door heater controls - Reach-in Freezer","Controls turn off door heaters when humidity is low","Door heaters (to prevent condensation) constantly on","Freezer door",12,0,{"$f":"AA75*AC75*AE75*8760","v":1277.7336000000003},null,null,null,1277.7336000000003,null,"No",null,null,null,null,null,null,null,1,1,null,"kWbase",0.19500000000000001,"Energy Savings Factor (assume humidity sensor)",0.55000000000000004,"Bonus Factor (low temp)",1.36]
["Commercial","Refrigeration","ECM motors for walk-in and reach-in Refrigerator","Electronically Commutated Motor installed on the evaporator","Shaded pole evaporator motor","motor",15,5.0000000000000001E-3,348,null,null,null,348,null,"No",null,null,null,null,null,null,null,{"$f":"IF(ISBLANK(P76),1,sHDD/P76)","v":1},{"$f":"IF(ISBLANK(Q76),1,sCDD/Q76)","v":1},"Average of restaurant/grocery walk-in and grocery reach-in, Illinois TRM"]
["Commercial","Refrigeration","ECM motors for walk-in and reach-in Freezer","Electronically Commutated Motor installed on the evaporator","Shaded pole evaporator motor","motor",15,5.0000000000000001E-3,522,null,null,null,522,null,"No",null,null,null,null,null,null,null,1,1,"Average of restaurant/grocery walk-in and grocery reach-in, Illinois TRM"]
["Commercial","Refrigeration","Efficient Refrigerated Vending Machine with efficient compressor and lighting","Vending machine with efficient compressor and lighting (ENERGY STAR or equivalent)","Conventional vending machine","machine",14,5.0000000000000001E-3,1310,null,null,null,1310,null,"No",null,null,null,null,null,null,null,1,1]
["Commercial","Refrigeration","Efficient Refrigerated Vending Machine with control software, efficient compressor and lighting","Vending machine with control software, efficient compressor and lighting (ENERGY STAR or equivalent)","Conventional vending machine","machine",14,5.0000000000000001E-3,1842,null,null,null,1842,null,"No",null,null,null,null,null,null,null,1,1]
["Commercial","Refrigeration","Evaporator Fan Control for walk-in cooler","Controls to reduce evaporator fan airflow when there is no refrigerant flow","Walk-in cooler without controls","motor",16,5.0000000000000001E-3,478,null,null,null,478,null,"No",null,null,null,null,null,null,null,1,1]
["Commercial","Refrigeration","Strip Curtain for Walk-in Cooler","Plastic strip curtain added to walk-in cooler or freezer","Walk-in cooler with conventional door only","Refrigerator door",6,0,422,null,null,null,422,null,"No",null,null,null,null,null,null,null,1,1]
["Commercial","Refrigeration","Strip Curtain for Walk-in Freezer","Plastic strip curtain added to walk-in cooler or freezer","Walk-in cooler with conventional door only","Freezer door",6,0,2974,null,null,null,2974,null,"No",null,null,null,null,null,null,null,1,1]
["Commercial","HVAC",{"$f":"\"Efficient Room AC COP = \"&AC83&\" to \"&AE83","v":"Efficient Room AC COP = 2.4 to 2.8"},{"$f":"\"Room AC with coefficient of performance = \"&$AE83","v":"Room AC with coefficient of performance = 2.8"},{"$f":"\"Room AC with coefficient of performance = \"&$AC83","v":"Room AC with coefficient of performance = 2.4"},"kW of cooling capacity",9,5.0000000000000001E-3,{"$f":"$AA83*$AG83/AC83","v":105.83333333333334},{"$f":"$AA83*$AG83/AE83","v":90.714285714285722},null,null,15.11904761904762,0,"Yes",3474,464,{"$f":"'CDD-energy curve fit'!$D$3*Data!Q83+'CDD-energy curve fit'!$E$3","v":3183.9536000000003},{"$f":"'CDD-energy curve fit'!$D$3*sCDD+'CDD-energy curve fit'!$E$3","v":1279.8220000000001},{"$f":"S83/R83","v":0.40196000343723604},{"$f":"M83*T83","v":6.0772524329201172},{"$f":"N83","v":0},0.20293609671848015,6.4655172413793108E-2,"Full load hours from Illinois TRM. COP ranges based on professional judgement","Full Load Hours (Chicago)",254,"Base COP",2.4,"Upgrade COP",2.8,"Capacity (kW)",1]
["Commercial","HVAC",{"$f":"\"Efficient Room AC COP = \"&AC84&\" to \"&AE84","v":"Efficient Room AC COP = 2.4 to 3.2"},{"$f":"\"Room AC with coefficient of performance = \"&$AE84","v":"Room AC with coefficient of performance = 3.2"},{"$f":"\"Room AC with coefficient of performance = \"&$AC84","v":"Room AC with coefficient of performance = 2.4"},"kW of cooling capacity",9,5.0000000000000001E-3,105.83333333333334,79.375,null,null,26.458333333333343,0,"Yes",3474,464,{"$f":"'CDD-energy curve fit'!$D$3*Data!Q84+'CDD-energy curve fit'!$E$3","v":3183.9536000000003},{"$f":"'CDD-energy curve fit'!$D$3*sCDD+'CDD-energy curve fit'!$E$3","v":1279.8220000000001},0.40196000343723604,10.635191757610206,0,0.20293609671848015,6.4655172413793108E-2,"Full load hours from Illinois TRM. COP ranges based on professional judgement","Full Load Hours (Chicago)",254,"Base COP",2.4,"Upgrade COP",3.2,"Capacity (kW)",1]
["Commercial","HVAC",{"$f":"\"Efficient Room AC COP = \"&AC85&\" to \"&AE85","v":"Efficient Room AC COP = 2.4 to 3.6"},"Room AC with coefficient of performance = 3.6","Room AC with coefficient of performance = 2.4","kW of cooling capacity",9,5.0000000000000001E-3,105.83333333333334,70.555555555555557,null,null,35.277777777777786,0,"Yes",3474,464,{"$f":"'CDD-energy curve fit'!$D$3*Data!Q85+'CDD-energy curve fit'!$E$3","v":3183.9536000000003},{"$f":"'CDD-energy curve fit'!$D$3*sCDD+'CDD-energy curve fit'!$E$3","v":1279.8220000000001},0.40196000343723604,14.180255676813609,0,0.20293609671848015,6.4655172413793108E-2,"Full load hours from Illinois TRM. COP ranges based on professional judgement","Full Load Hours (Chicago)",254,"Base COP",2.4,"Upgrade COP",3.6,"Capacity (kW)",1]
["Commercial","HVAC","Efficient Room AC COP = 2.4 to 4","Room AC with coefficient of performance = 4","Room AC with coefficient of performance = 2.4","kW of cooling capacity",9,5.0000000000000001E-3,105.83333333333334,63.5,null,null,42.333333333333343,0,"Yes",3474,464,{"$f":"'CDD-energy curve fit'!$D$3*Data!Q86+'CDD-energy curve fit'!$E$3","v":3183.9536000000003},{"$f":"'CDD-energy curve fit'!$D$3*sCDD+'CDD-energy curve fit'!$E$3","v":1279.8220000000001},0.40196000343723604,17.016306812176328,0,0.20293609671848015,6.4655172413793108E-2,"Full load hours from Illinois TRM. COP ranges based on professional judgement","Full Load Hours (Chicago)",254,"Base COP",2.4,"Upgrade COP",4,"Capacity (kW)",1]
["Commercial","HVAC",{"$f":"\"Efficient Room AC COP = \"&AC87&\" to \"&AE87","v":"Efficient Room AC COP = 2.4 to 4.4"},"Room AC with coefficient of performance = 4.4","Room AC with coefficient of performance = 2.4","kW of cooling capacity",9,5.0000000000000001E-3,105.83333333333334,57.72727272727272,null,null,48.106060606060623,0,"Yes",3474,464,{"$f":"'CDD-energy curve fit'!$D$3*Data!Q87+'CDD-energy curve fit'!$E$3","v":3183.9536000000003},{"$f":"'CDD-energy curve fit'!$D$3*sCDD+'CDD-energy curve fit'!$E$3","v":1279.8220000000001},0.40196000343723604,19.336712286564012,0,0.20293609671848015,6.4655172413793108E-2,"Full load hours from Illinois TRM. COP ranges based on professional judgement","Full Load Hours (Chicago)",254,"Base COP",2.4,"Upgrade COP",4.4000000000000004,"Capacity (kW)",1]
["Commercial","HVAC",{"$f":"\"Efficient Room AC COP = \"&AC88&\" to \"&AE88","v":"Efficient Room AC COP = 2.8 to 3.2"},"Room AC with coefficient of performance = 3.2","Room AC with coefficient of performance = 2.8","kW of cooling capacity",9,5.0000000000000001E-3,90.714285714285722,79.375,null,null,11.339285714285722,0,"Yes",3474,464,{"$f":"'CDD-energy curve fit'!$D$3*Data!Q88+'CDD-energy curve fit'!$E$3","v":3183.9536000000003},{"$f":"'CDD-energy curve fit'!$D$3*sCDD+'CDD-energy curve fit'!$E$3","v":1279.8220000000001},0.40196000343723604,4.5579393246900901,0,0.20293609671848015,6.4655172413793108E-2,"Full load hours from Illinois TRM. COP ranges based on professional judgement","Full Load Hours (Chicago)",254,"Base COP",2.8,"Upgrade COP",3.2,"Capacity (kW)",1]
["Commercial","HVAC",{"$f":"\"Efficient Room AC COP = \"&AC89&\" to \"&AE89","v":"Efficient Room AC COP = 2.8 to 3.6"},"Room AC with coefficient of performance = 3.6","Room AC with coefficient of performance = 2.8","kW of cooling capacity",9,5.0000000000000001E-3,{"$f":"$AA89*$AG89/AC89","v":90.714285714285722},{"$f":"$AA89*$AG89/AE89","v":70.555555555555557},null,null,20.158730158730165,0,"Yes",3474,464,{"$f":"'CDD-energy curve fit'!$D$3*Data!Q89+'CDD-energy curve fit'!$E$3","v":3183.9536000000003},{"$f":"'CDD-energy curve fit'!$D$3*sCDD+'CDD-energy curve fit'!$E$3","v":1279.8220000000001},0.40196000343723604,8.1030032438934914,0,0.20293609671848015,6.4655172413793108E-2,"Full load hours from Illinois TRM. COP ranges based on professional judgement","Full Load Hours (Chicago)",254,"Base COP",2.8,"Upgrade COP",3.6,"Capacity (kW)",1]
["Commercial","HVAC","Efficient Room AC COP = 2.8 to 4","Room AC with coefficient of performance = 4","Room AC with coefficient of performance = 2.8","kW of cooling capacity",9,5.0000000000000001E-3,90.714285714285722,63.5,null,null,27.214285714285722,0,"Yes",3474,464,{"$f":"'CDD-energy curve fit'!$D$3*Data!Q90+'CDD-energy curve fit'!$E$3","v":3183.9536000000003},{"$f":"'CDD-energy curve fit'!$D$3*sCDD+'CDD-energy curve fit'!$E$3","v":1279.8220000000001},0.40196000343723604,10.939054379256213,0,0.20293609671848015,6.4655172413793108E-2,"Full load hours from Illinois TRM. COP ranges based on professional judgement","Full Load Hours (Chicago)",254,"Base COP",2.8,"Upgrade COP",4,"Capacity (kW)",1]
["Commercial","HVAC",{"$f":"\"Efficient Room AC COP = \"&AC91&\" to \"&AE91","v":"Efficient Room AC COP = 2.8 to 4.4"},"Room AC with coefficient of performance = 4.4","Room AC with coefficient of performance = 2.8","kW of cooling capacity",9,5.0000000000000001E-3,{"$f":"$AA91*$AG91/AC91","v":90.714285714285722},{"$f":"$AA91*$AG91/AE91","v":57.72727272727272},null,null,32.987012987013003,0,"Yes",3474,464,{"$f":"'CDD-energy curve fit'!$D$3*Data!Q91+'CDD-energy curve fit'!$E$3","v":3183.9536000000003},{"$f":"'CDD-energy curve fit'!$D$3*sCDD+'CDD-energy curve fit'!$E$3","v":1279.8220000000001},0.40196000343723604,13.259459853643897,0,0.20293609671848015,6.4655172413793108E-2,"Full load hours from Illinois TRM. COP ranges based on professional judgement","Full Load Hours (Chicago)",254,"Base COP",2.8,"Upgrade COP",4.4000000000000004,"Capacity (kW)",1]
["Commercial","HVAC",{"$f":"\"Efficient Room AC COP = \"&AC92&\" to \"&AE92","v":"Efficient Room AC COP = 3 to 3.2"},"Room AC with coefficient of performance = 3.2","Room AC with coefficient of performance = 3","kW of cooling capacity",9,5.0000000000000001E-3,{"$f":"$AA92*$AG92/AC92","v":84.666666666666671},{"$f":"$AA92*$AG92/AE92","v":79.375},null,null,5.2916666666666714,0,"Yes",3474,464,{"$f":"'CDD-energy curve fit'!$D$3*Data!Q92+'CDD-energy curve fit'!$E$3","v":3183.9536000000003},{"$f":"'CDD-energy curve fit'!$D$3*sCDD+'CDD-energy curve fit'!$E$3","v":1279.8220000000001},0.40196000343723604,2.1270383515220428,0,0.20293609671848015,6.4655172413793108E-2,"Full load hours from Illinois TRM. COP ranges based on professional judgement","Full Load Hours (Chicago)",254,"Base COP",3,"Upgrade COP",3.2,"Capacity (kW)",1]
["Commercial","HVAC","Efficient Room AC COP = 3 to 3.6","Room AC with coefficient of performance = 3.6","Room AC with coefficient of performance = 3","kW of cooling capacity",9,5.0000000000000001E-3,84.666666666666671,70.555555555555557,null,null,14.111111111111114,0,"Yes",3474,464,{"$f":"'CDD-energy curve fit'!$D$3*Data!Q93+'CDD-energy curve fit'!$E$3","v":3183.9536000000003},{"$f":"'CDD-energy curve fit'!$D$3*sCDD+'CDD-energy curve fit'!$E$3","v":1279.8220000000001},0.40196000343723604,5.6721022707254427,0,0.20293609671848015,6.4655172413793108E-2,"Full load hours from Illinois TRM. COP ranges based on professional judgement","Full Load Hours (Chicago)",254,"Base COP",3,"Upgrade COP",3.6,"Capacity (kW)",1]
["Commercial","HVAC",{"$f":"\"Efficient Room AC COP = \"&AC94&\" to \"&AE94","v":"Efficient Room AC COP = 3 to 4"},"Room AC with coefficient of performance = 4","Room AC with coefficient of performance = 3","kW of cooling capacity",9,5.0000000000000001E-3,{"$f":"$AA94*$AG94/AC94","v":84.666666666666671},{"$f":"$AA94*$AG94/AE94","v":63.5},null,null,21.166666666666671,0,"Yes",3474,464,{"$f":"'CDD-energy curve fit'!$D$3*Data!Q94+'CDD-energy curve fit'!$E$3","v":3183.9536000000003},{"$f":"'CDD-energy curve fit'!$D$3*sCDD+'CDD-energy curve fit'!$E$3","v":1279.8220000000001},0.40196000343723604,8.5081534060881641,0,0.20293609671848015,6.4655172413793108E-2,"Full load hours from Illinois TRM. COP ranges based on professional judgement","Full Load Hours (Chicago)",254,"Base COP",3,"Upgrade COP",4,"Capacity (kW)",1]
["Commercial","HVAC",{"$f":"\"Efficient Room AC COP = \"&AC95&\" to \"&AE95","v":"Efficient Room AC COP = 3 to 4.4"},"Room AC with coefficient of performance = 4.4","Room AC with coefficient of performance = 3","kW of cooling capacity",9,5.0000000000000001E-3,{"$f":"$AA95*$AG95/AC95","v":84.666666666666671},{"$f":"$AA95*$AG95/AE95","v":57.72727272727272},null,null,26.939393939393952,0,"Yes",3474,464,{"$f":"'CDD-energy curve fit'!$D$3*Data!Q95+'CDD-energy curve fit'!$E$3","v":3183.9536000000003},{"$f":"'CDD-energy curve fit'!$D$3*sCDD+'CDD-energy curve fit'!$E$3","v":1279.8220000000001},0.40196000343723604,10.828558880475848,0,0.20293609671848015,6.4655172413793108E-2,"Full load hours from Illinois TRM. COP ranges based on professional judgement","Full Load Hours (Chicago)",254,"Base COP",3,"Upgrade COP",4.4000000000000004,"Capacity (kW)",1]
["Commercial","HVAC",{"$f":"\"Efficient Room AC COP = \"&AC96&\" to \"&AE96","v":"Efficient Room AC COP = 3.2 to 3.6"},"Room AC with coefficient of performance = 3.6","Room AC with coefficient of performance = 3.2","kW of cooling capacity",9,5.0000000000000001E-3,{"$f":"$AA96*$AG96/AC96","v":79.375},{"$f":"$AA96*$AG96/AE96","v":70.555555555555557},null,null,8.8194444444444429,0,"Yes",3474,464,{"$f":"'CDD-energy curve fit'!$D$3*Data!Q96+'CDD-energy curve fit'!$E$3","v":3183.9536000000003},{"$f":"'CDD-energy curve fit'!$D$3*sCDD+'CDD-energy curve fit'!$E$3","v":1279.8220000000001},0.40196000343723604,3.5450639192034004,0,0.20293609671848015,6.4655172413793108E-2,"Full load hours from Illinois TRM. COP ranges based on professional judgement","Full Load Hours (Chicago)",254,"Base COP",3.2,"Upgrade COP",3.6,"Capacity (kW)",1]
["Commercial","HVAC","Efficient Room AC COP = 3.2 to 4","Room AC with coefficient of performance = 4","Room AC with coefficient of performance = 3.2","kW of cooling capacity",9,5.0000000000000001E-3,79.375,63.5,null,null,15.875,0,"Yes",3474,464,{"$f":"'CDD-energy curve fit'!$D$3*Data!Q97+'CDD-energy curve fit'!$E$3","v":3183.9536000000003},{"$f":"'CDD-energy curve fit'!$D$3*sCDD+'CDD-energy curve fit'!$E$3","v":1279.8220000000001},0.40196000343723604,6.3811150545661217,0,0.20293609671848015,6.4655172413793108E-2,"Full load hours from Illinois TRM. COP ranges based on professional judgement","Full Load Hours (Chicago)",254,"Base COP",3.2,"Upgrade COP",4,"Capacity (kW)",1]
["Commercial","HVAC",{"$f":"\"Efficient Room AC COP = \"&AC98&\" to \"&AE98","v":"Efficient Room AC COP = 3.2 to 4.4"},"Room AC with coefficient of performance = 4.4","Room AC with coefficient of performance = 3.2","kW of cooling capacity",9,5.0000000000000001E-3,{"$f":"$AA98*$AG98/AC98","v":79.375},{"$f":"$AA98*$AG98/AE98","v":57.72727272727272},null,null,{"$f":"I98-J98","v":21.64772727272728},0,"Yes",3474,464,{"$f":"'CDD-energy curve fit'!$D$3*Data!Q98+'CDD-energy curve fit'!$E$3","v":3183.9536000000003},{"$f":"'CDD-energy curve fit'!$D$3*sCDD+'CDD-energy curve fit'!$E$3","v":1279.8220000000001},0.40196000343723604,8.7015205289538056,0,0.20293609671848015,6.4655172413793108E-2,"Full load hours from Illinois TRM. COP ranges based on professional judgement","Full Load Hours (Chicago)",254,"Base COP",3.2,"Upgrade COP",4.4000000000000004,"Capacity (kW)",1]
["Commercial","HVAC",{"$f":"\"Efficient Unitary AC COP = \"&AC99&\" to \"&AE99","v":"Efficient Unitary AC COP = 2.4 to 2.8"},{"$f":"\"Unitary AC with coefficient of performance = \"&$AE99","v":"Unitary AC with coefficient of performance = 2.8"},{"$f":"\"Unitary AC with coefficient of performance = \"&$AC99","v":"Unitary AC with coefficient of performance = 2.4"},"kW of cooling capacity",15,5.0000000000000001E-3,341.25,292.5,null,null,48.75,0,"Yes",3474,464,{"$f":"'CDD-energy curve fit'!$D$3*Data!Q99+'CDD-energy curve fit'!$E$3","v":3183.9536000000003},{"$f":"'CDD-energy curve fit'!$D$3*sCDD+'CDD-energy curve fit'!$E$3","v":1279.8220000000001},0.40196000343723604,19.595550167565257,0,0.20293609671848015,6.4655172413793108E-2,"Full load hours from Illinois TRM. COP ranges based on professional judgement","Full Load Hours (Chicago)",819,"Base COP",2.4,"Upgrade COP",2.8,"Capacity (kW)",1]
["Commercial","HVAC",{"$f":"\"Efficient Unitary AC COP = \"&AC100&\" to \"&AE100","v":"Efficient Unitary AC COP = 2.4 to 3.2"},{"$f":"\"Unitary AC with coefficient of performance = \"&$AE100","v":"Unitary AC with coefficient of performance = 3.2"},{"$f":"\"Unitary AC with coefficient of performance = \"&$AC100","v":"Unitary AC with coefficient of performance = 2.4"},"kW of cooling capacity",15,5.0000000000000001E-3,341.25,255.9375,null,null,85.3125,0,"Yes",3474,464,{"$f":"'CDD-energy curve fit'!$D$3*Data!Q100+'CDD-energy curve fit'!$E$3","v":3183.9536000000003},{"$f":"'CDD-energy curve fit'!$D$3*sCDD+'CDD-energy curve fit'!$E$3","v":1279.8220000000001},0.40196000343723604,34.292212793239202,0,0.20293609671848015,6.4655172413793108E-2,"Full load hours from Illinois TRM. COP ranges based on professional judgement","Full Load Hours (Chicago)",819,"Base COP",2.4,"Upgrade COP",3.2,"Capacity (kW)",1]
["Commercial","HVAC","Efficient Unitary AC COP = 2.4 to 3.6","Unitary AC with coefficient of performance = 3.6","Unitary AC with coefficient of performance = 2.4","kW of cooling capacity",15,5.0000000000000001E-3,341.25,227.5,null,null,113.75,0,"Yes",3474,464,{"$f":"'CDD-energy curve fit'!$D$3*Data!Q101+'CDD-energy curve fit'!$E$3","v":3183.9536000000003},{"$f":"'CDD-energy curve fit'!$D$3*sCDD+'CDD-energy curve fit'!$E$3","v":1279.8220000000001},0.40196000343723604,45.722950390985602,0,0.20293609671848015,6.4655172413793108E-2,"Full load hours from Illinois TRM. COP ranges based on professional judgement","Full Load Hours (Chicago)",819,"Base COP",2.4,"Upgrade COP",3.6,"Capacity (kW)",1]
["Commercial","HVAC","Efficient Unitary AC COP = 2.4 to 4","Unitary AC with coefficient of performance = 4","Unitary AC with coefficient of performance = 2.4","kW of cooling capacity",15,5.0000000000000001E-3,341.25,204.75,null,null,136.5,0,"Yes",3474,464,{"$f":"'CDD-energy curve fit'!$D$3*Data!Q102+'CDD-energy curve fit'!$E$3","v":3183.9536000000003},{"$f":"'CDD-energy curve fit'!$D$3*sCDD+'CDD-energy curve fit'!$E$3","v":1279.8220000000001},0.40196000343723604,54.867540469182721,0,0.20293609671848015,6.4655172413793108E-2,"Full load hours from Illinois TRM. COP ranges based on professional judgement","Full Load Hours (Chicago)",819,"Base COP",2.4,"Upgrade COP",4,"Capacity (kW)",1]
["Commercial","HVAC","Efficient Unitary AC COP = 2.4 to 4.4","Unitary AC with coefficient of performance = 4.4","Unitary AC with coefficient of performance = 2.4","kW of cooling capacity",15,5.0000000000000001E-3,341.25,186.13636363636363,null,null,155.11363636363637,0,"Yes",3474,464,{"$f":"'CDD-energy curve fit'!$D$3*Data!Q103+'CDD-energy curve fit'!$E$3","v":3183.9536000000003},{"$f":"'CDD-energy curve fit'!$D$3*sCDD+'CDD-energy curve fit'!$E$3","v":1279.8220000000001},0.40196000343723604,62.349477805889457,0,0.20293609671848015,6.4655172413793108E-2,"Full load hours from Illinois TRM. COP ranges based on professional judgement","Full Load Hours (Chicago)",819,"Base COP",2.4,"Upgrade COP",4.4000000000000004,"Capacity (kW)",1]
["Commercial","HVAC","Efficient Unitary AC COP = 2.8 to 3.2","Unitary AC with coefficient of performance = 3.2","Unitary AC with coefficient of performance = 2.8","kW of cooling capacity",15,5.0000000000000001E-3,292.5,255.9375,null,null,36.5625,0,"Yes",3474,464,{"$f":"'CDD-energy curve fit'!$D$3*Data!Q104+'CDD-energy curve fit'!$E$3","v":3183.9536000000003},{"$f":"'CDD-energy curve fit'!$D$3*sCDD+'CDD-energy curve fit'!$E$3","v":1279.8220000000001},0.40196000343723604,14.696662625673943,0,0.20293609671848015,6.4655172413793108E-2,"Full load hours from Illinois TRM. COP ranges based on professional judgement","Full Load Hours (Chicago)",819,"Base COP",2.8,"Upgrade COP",3.2,"Capacity (kW)",1]
["Commercial","HVAC","Efficient Unitary AC COP = 2.8 to 3.6","Unitary AC with coefficient of performance = 3.6","Unitary AC with coefficient of performance = 2.8","kW of cooling capacity",15,5.0000000000000001E-3,{"$f":"$AA105*$AG105/AC105","v":292.5},{"$f":"$AA105*$AG105/AE105","v":227.5},null,null,65,0,"Yes",3474,464,{"$f":"'CDD-energy curve fit'!$D$3*Data!Q105+'CDD-energy curve fit'!$E$3","v":3183.9536000000003},{"$f":"'CDD-energy curve fit'!$D$3*sCDD+'CDD-energy curve fit'!$E$3","v":1279.8220000000001},0.40196000343723604,26.127400223420342,0,0.20293609671848015,6.4655172413793108E-2,"Full load hours from Illinois TRM. COP ranges based on professional judgement","Full Load Hours (Chicago)",819,"Base COP",2.8,"Upgrade COP",3.6,"Capacity (kW)",1]
["Commercial","HVAC","Efficient Unitary AC COP = 2.8 to 4","Unitary AC with coefficient of performance = 4","Unitary AC with coefficient of performance = 2.8","kW of cooling capacity",15,5.0000000000000001E-3,292.5,204.75,null,null,87.75,0,"Yes",3474,464,{"$f":"'CDD-energy curve fit'!$D$3*Data!Q106+'CDD-energy curve fit'!$E$3","v":3183.9536000000003},{"$f":"'CDD-energy curve fit'!$D$3*sCDD+'CDD-energy curve fit'!$E$3","v":1279.8220000000001},0.40196000343723604,35.271990301617464,0,0.20293609671848015,6.4655172413793108E-2,"Full load hours from Illinois TRM. COP ranges based on professional judgement","Full Load Hours (Chicago)",819,"Base COP",2.8,"Upgrade COP",4,"Capacity (kW)",1]
["Commercial","HVAC","Efficient Unitary AC COP = 2.8 to 4.4","Unitary AC with coefficient of performance = 4.4","Unitary AC with coefficient of performance = 2.8","kW of cooling capacity",15,5.0000000000000001E-3,{"$f":"$AA107*$AG107/AC107","v":292.5},{"$f":"$AA107*$AG107/AE107","v":186.13636363636363},null,null,106.36363636363637,0,"Yes",3474,464,{"$f":"'CDD-energy curve fit'!$D$3*Data!Q107+'CDD-energy curve fit'!$E$3","v":3183.9536000000003},{"$f":"'CDD-energy curve fit'!$D$3*sCDD+'CDD-energy curve fit'!$E$3","v":1279.8220000000001},0.40196000343723604,42.7539276383242,0,{"$f":"IF(ISBLANK(P107),1,sHDD/P107)","v":0.20293609671848015},{"$f":"IF(ISBLANK(Q107),1,sCDD/Q107)","v":6.4655172413793108E-2},"Full load hours from Illinois TRM. COP ranges based on professional judgement","Full Load Hours (Chicago)",819,"Base COP",2.8,"Upgrade COP",4.4000000000000004,"Capacity (kW)",1]
["Commercial","HVAC","Efficient Unitary AC COP = 3 to 3.2","Unitary AC with coefficient of performance = 3.2","Unitary AC with coefficient of performance = 3","kW of cooling capacity",15,5.0000000000000001E-3,{"$f":"$AA108*$AG108/AC108","v":273},{"$f":"$AA108*$AG108/AE108","v":255.9375},null,null,17.0625,0,"Yes",3474,464,{"$f":"'CDD-energy curve fit'!$D$3*Data!Q108+'CDD-energy curve fit'!$E$3","v":3183.9536000000003},{"$f":"'CDD-energy curve fit'!$D$3*sCDD+'CDD-energy curve fit'!$E$3","v":1279.8220000000001},0.40196000343723604,6.8584425586478401,0,0.20293609671848015,6.4655172413793108E-2,"Full load hours from Illinois TRM. COP ranges based on professional judgement","Full Load Hours (Chicago)",819,"Base COP",3,"Upgrade COP",3.2,"Capacity (kW)",1]
["Commercial","HVAC","Efficient Unitary AC COP = 3 to 3.6","Unitary AC with coefficient of performance = 3.6","Unitary AC with coefficient of performance = 3","kW of cooling capacity",15,5.0000000000000001E-3,273,227.5,null,null,45.5,0,"Yes",3474,464,{"$f":"'CDD-energy curve fit'!$D$3*Data!Q109+'CDD-energy curve fit'!$E$3","v":3183.9536000000003},{"$f":"'CDD-energy curve fit'!$D$3*sCDD+'CDD-energy curve fit'!$E$3","v":1279.8220000000001},0.40196000343723604,18.289180156394238,0,0.20293609671848015,6.4655172413793108E-2,"Full load hours from Illinois TRM. COP ranges based on professional judgement","Full Load Hours (Chicago)",819,"Base COP",3,"Upgrade COP",3.6,"Capacity (kW)",1]
["Commercial","HVAC","Efficient Unitary AC COP = 3 to 4","Unitary AC with coefficient of performance = 4","Unitary AC with coefficient of performance = 3","kW of cooling capacity",15,5.0000000000000001E-3,{"$f":"$AA110*$AG110/AC110","v":273},{"$f":"$AA110*$AG110/AE110","v":204.75},null,null,68.25,0,"Yes",3474,464,{"$f":"'CDD-energy curve fit'!$D$3*Data!Q110+'CDD-energy curve fit'!$E$3","v":3183.9536000000003},{"$f":"'CDD-energy curve fit'!$D$3*sCDD+'CDD-energy curve fit'!$E$3","v":1279.8220000000001},0.40196000343723604,27.433770234591361,0,0.20293609671848015,6.4655172413793108E-2,"Full load hours from Illinois TRM. COP ranges based on professional judgement","Full Load Hours (Chicago)",819,"Base COP",3,"Upgrade COP",4,"Capacity (kW)",1]
["Commercial","HVAC","Efficient Unitary AC COP = 3 to 4.4","Unitary AC with coefficient of performance = 4.4","Unitary AC with coefficient of performance = 3","kW of cooling capacity",15,5.0000000000000001E-3,{"$f":"$AA111*$AG111/AC111","v":273},{"$f":"$AA111*$AG111/AE111","v":186.13636363636363},null,null,86.863636363636374,0,"Yes",3474,464,{"$f":"'CDD-energy curve fit'!$D$3*Data!Q111+'CDD-energy curve fit'!$E$3","v":3183.9536000000003},{"$f":"'CDD-energy curve fit'!$D$3*sCDD+'CDD-energy curve fit'!$E$3","v":1279.8220000000001},0.40196000343723604,34.9157075712981,0,0.20293609671848015,6.4655172413793108E-2,"Full load hours from Illinois TRM. COP ranges based on professional judgement","Full Load Hours (Chicago)",819,"Base COP",3,"Upgrade COP",4.4000000000000004,"Capacity (kW)",1]
["Commercial","HVAC","Efficient Unitary AC COP = 3.2 to 3.6","Unitary AC with coefficient of performance = 3.6","Unitary AC with coefficient of performance = 3.2","kW of cooling capacity",15,5.0000000000000001E-3,255.9375,227.5,null,null,28.4375,0,"Yes",3474,464,{"$f":"'CDD-energy curve fit'!$D$3*Data!Q112+'CDD-energy curve fit'!$E$3","v":3183.9536000000003},{"$f":"'CDD-energy curve fit'!$D$3*sCDD+'CDD-energy curve fit'!$E$3","v":1279.8220000000001},0.40196000343723604,11.430737597746401,0,0.20293609671848015,6.4655172413793108E-2,"Full load hours from Illinois TRM. COP ranges based on professional judgement","Full Load Hours (Chicago)",819,"Base COP",3.2,"Upgrade COP",3.6,"Capacity (kW)",1]
["Commercial","HVAC","Efficient Unitary AC COP = 3.2 to 4","Unitary AC with coefficient of performance = 4","Unitary AC with coefficient of performance = 3.2","kW of cooling capacity",15,5.0000000000000001E-3,255.9375,204.75,null,null,51.1875,0,"Yes",3474,464,{"$f":"'CDD-energy curve fit'!$D$3*Data!Q113+'CDD-energy curve fit'!$E$3","v":3183.9536000000003},{"$f":"'CDD-energy curve fit'!$D$3*sCDD+'CDD-energy curve fit'!$E$3","v":1279.8220000000001},0.40196000343723604,20.57532767594352,0,0.20293609671848015,6.4655172413793108E-2,"Full load hours from Illinois TRM. COP ranges based on professional judgement","Full Load Hours (Chicago)",819,"Base COP",3.2,"Upgrade COP",4,"Capacity (kW)",1]
["Commercial","HVAC","Efficient Unitary AC COP = 3.2 to 4.4","Unitary AC with coefficient of performance = 4.4","Unitary AC with coefficient of performance = 3.2","kW of cooling capacity",15,5.0000000000000001E-3,{"$f":"$AA114*$AG114/AC114","v":255.9375},{"$f":"$AA114*$AG114/AE114","v":186.13636363636363},null,null,69.801136363636374,0,"Yes",3474,464,{"$f":"'CDD-energy curve fit'!$D$3*Data!Q114+'CDD-energy curve fit'!$E$3","v":3183.9536000000003},{"$f":"'CDD-energy curve fit'!$D$3*sCDD+'CDD-energy curve fit'!$E$3","v":1279.8220000000001},0.40196000343723604,28.057265012650259,0,0.20293609671848015,6.4655172413793108E-2,"Full load hours from Illinois TRM. COP ranges based on professional judgement","Full Load Hours (Chicago)",819,"Base COP",3.2,"Upgrade COP",4.4000000000000004,"Capacity (kW)",1]
["Commercial","HVAC",{"$f":"\"Efficient Chiller AC COP = \"&AC115&\" to \"&AE115","v":"Efficient Chiller AC COP = 2.4 to 2.8"},{"$f":"\"Chiller with coefficient of performance = \"&$AE115","v":"Chiller with coefficient of performance = 2.8"},{"$f":"\"Chiller with coefficient of performance = \"&$AC115","v":"Chiller with coefficient of performance = 2.4"},"kW of cooling capacity",15,5.0000000000000001E-3,559.58333333333337,479.64285714285717,null,null,79.940476190476204,0,"Yes",3474,464,{"$f":"'CDD-energy curve fit'!$D$3*Data!Q115+'CDD-energy curve fit'!$E$3","v":3183.9536000000003},{"$f":"'CDD-energy curve fit'!$D$3*sCDD+'CDD-energy curve fit'!$E$3","v":1279.8220000000001},0.40196000343723604,32.132874084298102,0,0.20293609671848015,6.4655172413793108E-2,"Full load hours from Illinois TRM. COP ranges based on professional judgement","Full Load Hours (Chicago)",1343,"Base COP",2.4,"Upgrade COP",2.8,"Capacity (kW)",1]
["Commercial","HVAC",{"$f":"\"Efficient Chiller AC COP = \"&AC116&\" to \"&AE116","v":"Efficient Chiller AC COP = 2.4 to 3.2"},{"$f":"\"Chiller with coefficient of performance = \"&$AE116","v":"Chiller with coefficient of performance = 3.2"},{"$f":"\"Chiller with coefficient of performance = \"&$AC116","v":"Chiller with coefficient of performance = 2.4"},"kW of cooling capacity",15,5.0000000000000001E-3,559.58333333333337,419.6875,null,null,139.89583333333337,0,"Yes",3474,464,{"$f":"'CDD-energy curve fit'!$D$3*Data!Q116+'CDD-energy curve fit'!$E$3","v":3183.9536000000003},{"$f":"'CDD-energy curve fit'!$D$3*sCDD+'CDD-energy curve fit'!$E$3","v":1279.8220000000001},0.40196000343723604,56.23252964752168,0,0.20293609671848015,6.4655172413793108E-2,"Full load hours from Illinois TRM. COP ranges based on professional judgement","Full Load Hours (Chicago)",1343,"Base COP",2.4,"Upgrade COP",3.2,"Capacity (kW)",1]
["Commercial","HVAC","Efficient Chiller AC COP = 2.4 to 3.6","Chiller with coefficient of performance = 3.6","Chiller with coefficient of performance = 2.4","kW of cooling capacity",15,5.0000000000000001E-3,559.58333333333337,373.05555555555554,null,null,186.52777777777783,0,"Yes",3474,464,{"$f":"'CDD-energy curve fit'!$D$3*Data!Q117+'CDD-energy curve fit'!$E$3","v":3183.9536000000003},{"$f":"'CDD-energy curve fit'!$D$3*sCDD+'CDD-energy curve fit'!$E$3","v":1279.8220000000001},0.40196000343723604,74.976706196695574,0,0.20293609671848015,6.4655172413793108E-2,"Full load hours from Illinois TRM. COP ranges based on professional judgement","Full Load Hours (Chicago)",1343,"Base COP",2.4,"Upgrade COP",3.6,"Capacity (kW)",1]
["Commercial","HVAC","Efficient Chiller AC COP = 2.4 to 4","Chiller with coefficient of performance = 4","Chiller with coefficient of performance = 2.4","kW of cooling capacity",15,5.0000000000000001E-3,559.58333333333337,335.75,null,null,223.83333333333337,0,"Yes",3474,464,{"$f":"'CDD-energy curve fit'!$D$3*Data!Q118+'CDD-energy curve fit'!$E$3","v":3183.9536000000003},{"$f":"'CDD-energy curve fit'!$D$3*sCDD+'CDD-energy curve fit'!$E$3","v":1279.8220000000001},0.40196000343723604,89.972047436034686,0,0.20293609671848015,6.4655172413793108E-2,"Full load hours from Illinois TRM. COP ranges based on professional judgement","Full Load Hours (Chicago)",1343,"Base COP",2.4,"Upgrade COP",4,"Capacity (kW)",1]
["Commercial","HVAC","Efficient Chiller AC COP = 2.4 to 4.4","Chiller with coefficient of performance = 4.4","Chiller with coefficient of performance = 2.4","kW of cooling capacity",15,5.0000000000000001E-3,559.58333333333337,305.22727272727269,null,null,254.35606060606068,0,"Yes",3474,464,{"$f":"'CDD-energy curve fit'!$D$3*Data!Q119+'CDD-energy curve fit'!$E$3","v":3183.9536000000003},{"$f":"'CDD-energy curve fit'!$D$3*sCDD+'CDD-energy curve fit'!$E$3","v":1279.8220000000001},0.40196000343723604,102.24096299549397,0,0.20293609671848015,6.4655172413793108E-2,"Full load hours from Illinois TRM. COP ranges based on professional judgement","Full Load Hours (Chicago)",1343,"Base COP",2.4,"Upgrade COP",4.4000000000000004,"Capacity (kW)",1]
["Commercial","HVAC","Efficient Chiller AC COP = 2.8 to 3.2","Chiller with coefficient of performance = 3.2","Chiller with coefficient of performance = 2.8","kW of cooling capacity",15,5.0000000000000001E-3,479.64285714285717,419.6875,null,null,59.955357142857167,0,"Yes",3474,464,{"$f":"'CDD-energy curve fit'!$D$3*Data!Q120+'CDD-energy curve fit'!$E$3","v":3183.9536000000003},{"$f":"'CDD-energy curve fit'!$D$3*sCDD+'CDD-energy curve fit'!$E$3","v":1279.8220000000001},0.40196000343723604,24.099655563223582,0,0.20293609671848015,6.4655172413793108E-2,"Full load hours from Illinois TRM. COP ranges based on professional judgement","Full Load Hours (Chicago)",1343,"Base COP",2.8,"Upgrade COP",3.2,"Capacity (kW)",1]
["Commercial","HVAC","Efficient Chiller AC COP = 2.8 to 3.6","Chiller with coefficient of performance = 3.6","Chiller with coefficient of performance = 2.8","kW of cooling capacity",15,5.0000000000000001E-3,{"$f":"$AA121*$AG121/AC121","v":479.64285714285717},{"$f":"$AA121*$AG121/AE121","v":373.05555555555554},null,null,106.58730158730162,0,"Yes",3474,464,{"$f":"'CDD-energy curve fit'!$D$3*Data!Q121+'CDD-energy curve fit'!$E$3","v":3183.9536000000003},{"$f":"'CDD-energy curve fit'!$D$3*sCDD+'CDD-energy curve fit'!$E$3","v":1279.8220000000001},0.40196000343723604,42.843832112397472,0,0.20293609671848015,6.4655172413793108E-2,"Full load hours from Illinois TRM. COP ranges based on professional judgement","Full Load Hours (Chicago)",1343,"Base COP",2.8,"Upgrade COP",3.6,"Capacity (kW)",1]
["Commercial","HVAC","Efficient Chiller AC COP = 2.8 to 4","Chiller with coefficient of performance = 4","Chiller with coefficient of performance = 2.8","kW of cooling capacity",15,5.0000000000000001E-3,479.64285714285717,335.75,null,null,143.89285714285717,0,"Yes",3474,464,{"$f":"'CDD-energy curve fit'!$D$3*Data!Q122+'CDD-energy curve fit'!$E$3","v":3183.9536000000003},{"$f":"'CDD-energy curve fit'!$D$3*sCDD+'CDD-energy curve fit'!$E$3","v":1279.8220000000001},0.40196000343723604,57.839173351736584,0,0.20293609671848015,6.4655172413793108E-2,"Full load hours from Illinois TRM. COP ranges based on professional judgement","Full Load Hours (Chicago)",1343,"Base COP",2.8,"Upgrade COP",4,"Capacity (kW)",1]
["Commercial","HVAC","Efficient Chiller AC COP = 2.8 to 4.4","Chiller with coefficient of performance = 4.4","Chiller with coefficient of performance = 2.8","kW of cooling capacity",15,5.0000000000000001E-3,{"$f":"$AA123*$AG123/AC123","v":479.64285714285717},{"$f":"$AA123*$AG123/AE123","v":305.22727272727269},null,null,174.41558441558448,0,"Yes",3474,464,{"$f":"'CDD-energy curve fit'!$D$3*Data!Q123+'CDD-energy curve fit'!$E$3","v":3183.9536000000003},{"$f":"'CDD-energy curve fit'!$D$3*sCDD+'CDD-energy curve fit'!$E$3","v":1279.8220000000001},0.40196000343723604,70.108088911195864,0,0.20293609671848015,6.4655172413793108E-2,"Full load hours from Illinois TRM. COP ranges based on professional judgement","Full Load Hours (Chicago)",1343,"Base COP",2.8,"Upgrade COP",4.4000000000000004,"Capacity (kW)",1]
["Commercial","HVAC","Efficient Chiller AC COP = 3 to 3.2","Chiller with coefficient of performance = 3.2","Chiller with coefficient of performance = 3","kW of cooling capacity",15,5.0000000000000001E-3,{"$f":"$AA124*$AG124/AC124","v":447.66666666666669},{"$f":"$AA124*$AG124/AE124","v":419.6875},null,null,27.979166666666686,0,"Yes",3474,464,{"$f":"'CDD-energy curve fit'!$D$3*Data!Q124+'CDD-energy curve fit'!$E$3","v":3183.9536000000003},{"$f":"'CDD-energy curve fit'!$D$3*sCDD+'CDD-energy curve fit'!$E$3","v":1279.8220000000001},0.40196000343723604,11.246505929504341,0,0.20293609671848015,6.4655172413793108E-2,"Full load hours from Illinois TRM. COP ranges based on professional judgement","Full Load Hours (Chicago)",1343,"Base COP",3,"Upgrade COP",3.2,"Capacity (kW)",1]
["Commercial","HVAC","Efficient Chiller AC COP = 3 to 3.6","Chiller with coefficient of performance = 3.6","Chiller with coefficient of performance = 3","kW of cooling capacity",15,5.0000000000000001E-3,447.66666666666669,373.05555555555554,null,null,74.611111111111143,0,"Yes",3474,464,{"$f":"'CDD-energy curve fit'!$D$3*Data!Q125+'CDD-energy curve fit'!$E$3","v":3183.9536000000003},{"$f":"'CDD-energy curve fit'!$D$3*sCDD+'CDD-energy curve fit'!$E$3","v":1279.8220000000001},0.40196000343723604,29.990682478678234,0,0.20293609671848015,6.4655172413793108E-2,"Full load hours from Illinois TRM. COP ranges based on professional judgement","Full Load Hours (Chicago)",1343,"Base COP",3,"Upgrade COP",3.6,"Capacity (kW)",1]
["Commercial","HVAC","Efficient Chiller AC COP = 3 to 4","Chiller with coefficient of performance = 4","Chiller with coefficient of performance = 3","kW of cooling capacity",15,5.0000000000000001E-3,{"$f":"$AA126*$AG126/AC126","v":447.66666666666669},{"$f":"$AA126*$AG126/AE126","v":335.75},null,null,111.91666666666669,0,"Yes",3474,464,{"$f":"'CDD-energy curve fit'!$D$3*Data!Q126+'CDD-energy curve fit'!$E$3","v":3183.9536000000003},{"$f":"'CDD-energy curve fit'!$D$3*sCDD+'CDD-energy curve fit'!$E$3","v":1279.8220000000001},0.40196000343723604,44.986023718017343,0,0.20293609671848015,6.4655172413793108E-2,"Full load hours from Illinois TRM. COP ranges based on professional judgement","Full Load Hours (Chicago)",1343,"Base COP",3,"Upgrade COP",4,"Capacity (kW)",1]
["Commercial","HVAC","Efficient Chiller AC COP = 3 to 4.4","Chiller with coefficient of performance = 4.4","Chiller with coefficient of performance = 3","kW of cooling capacity",15,5.0000000000000001E-3,{"$f":"$AA127*$AG127/AC127","v":447.66666666666669},{"$f":"$AA127*$AG127/AE127","v":305.22727272727269},null,null,142.43939393939399,0,"Yes",3474,464,{"$f":"'CDD-energy curve fit'!$D$3*Data!Q127+'CDD-energy curve fit'!$E$3","v":3183.9536000000003},{"$f":"'CDD-energy curve fit'!$D$3*sCDD+'CDD-energy curve fit'!$E$3","v":1279.8220000000001},0.40196000343723604,57.25493927747663,0,0.20293609671848015,6.4655172413793108E-2,"Full load hours from Illinois TRM. COP ranges based on professional judgement","Full Load Hours (Chicago)",1343,"Base COP",3,"Upgrade COP",4.4000000000000004,"Capacity (kW)",1]
["Commercial","HVAC","Efficient Chiller AC COP = 3.2 to 3.6","Chiller with coefficient of performance = 3.6","Chiller with coefficient of performance = 3.2","kW of cooling capacity",15,5.0000000000000001E-3,419.6875,373.05555555555554,null,null,46.631944444444457,0,"Yes",3474,464,{"$f":"'CDD-energy curve fit'!$D$3*Data!Q128+'CDD-energy curve fit'!$E$3","v":3183.9536000000003},{"$f":"'CDD-energy curve fit'!$D$3*sCDD+'CDD-energy curve fit'!$E$3","v":1279.8220000000001},0.40196000343723604,18.744176549173893,0,0.20293609671848015,6.4655172413793108E-2,"Full load hours from Illinois TRM. COP ranges based on professional judgement","Full Load Hours (Chicago)",1343,"Base COP",3.2,"Upgrade COP",3.6,"Capacity (kW)",1]
["Commercial","HVAC","Efficient Chiller AC COP = 3.2 to 4","Chiller with coefficient of performance = 4","Chiller with coefficient of performance = 3.2","kW of cooling capacity",15,5.0000000000000001E-3,419.6875,335.75,null,null,83.9375,0,"Yes",3474,464,{"$f":"'CDD-energy curve fit'!$D$3*Data!Q129+'CDD-energy curve fit'!$E$3","v":3183.9536000000003},{"$f":"'CDD-energy curve fit'!$D$3*sCDD+'CDD-energy curve fit'!$E$3","v":1279.8220000000001},0.40196000343723604,33.739517788512998,0,0.20293609671848015,6.4655172413793108E-2,"Full load hours from Illinois TRM. COP ranges based on professional judgement","Full Load Hours (Chicago)",1343,"Base COP",3.2,"Upgrade COP",4,"Capacity (kW)",1]
["Commercial","HVAC","Efficient Chiller AC COP = 3.2 to 4.4","Chiller with coefficient of performance = 4.4","Chiller with coefficient of performance = 3.2","kW of cooling capacity",15,5.0000000000000001E-3,{"$f":"$AA130*$AG130/AC130","v":419.6875},{"$f":"$AA130*$AG130/AE130","v":305.22727272727269},null,null,114.46022727272731,0,"Yes",3474,464,{"$f":"'CDD-energy curve fit'!$D$3*Data!Q130+'CDD-energy curve fit'!$E$3","v":3183.9536000000003},{"$f":"'CDD-energy curve fit'!$D$3*sCDD+'CDD-energy curve fit'!$E$3","v":1279.8220000000001},{"$f":"S130/R130","v":0.40196000343723604},46.008433347972286,0,0.20293609671848015,6.4655172413793108E-2,"Full load hours from Illinois TRM. COP ranges based on professional judgement","Full Load Hours (Chicago)",1343,"Base COP",3.2,"Upgrade COP",4.4000000000000004,"Capacity (kW)",1]
[null,null,null,null,null,null,null,null,null,null,null,null,null,null,null,null,null,null,null,null,null,null,1,1]
["Last Row","Last Row","Last Row","Last Row","Last Row","Last Row","Last Row",null,"Last Row","Last Row","Last Row","Last Row","Last Row","Last Row","Last Row",null,null,null,null,null,null,null,null,null,"Last Row","Last Row","Last Row","Last Row","Last Row","Last Row","Last Row","Last Row","Last Row"]

{"sheet":"CDD-energy curve fit","index":6,"n_rows":102,"n_cols":34,"rows_kept":102,"cut":false,"hidden":true,"merged":[]}
[null,"Sample Application:",null,null,null,null,null,null,null,null,null,"Reference Set - Small Office, 4.5 COP cooling curve, auto-sized heating/cooling system, randomly selected locations from the CLEER HDD/CDD list",null,null,null,null,null,null,null,null,null,null,null,null,"\"cut-in\" HDD curve fit - exclude cities with under 1000 HDD"]
[null,null,"CDD","M","b","Total Reference Office Cooling Electricity",null,null,null,null,null,"Random Count","Country","City","Weather File Name","Heating Degree Days","Cooling Degree Days","Heating Natural Gas (GJ)","Cooling Electricity (GJ)","Heating (Therms)","Cooling (kWh)",null,null,null,"Random Count","Country","City","Weather File Name","Heating Degree Days","Cooling Degree Days","Heating Natural Gas (GJ)","Cooling Electricity (GJ)","Heating (Therms)","Cooling (kWh)"]
[null,"Reference",500,4.3874000000000004,1148.2,{"$f":"C3*D3+E3","v":3341.9000000000005},null,null,null,null,null,143,"CAN","BC_Vancouver","CAN_BC_Vancouver.718920_CWEC",3020,5,46.1,4.58,{"$f":"R3*9.4782","v":436.94502},{"$f":"S3*277.778","v":1272.22324},null,null,null,512,"ITA","Genova","ITA_Genova.161200_IWEC",1348,653,11.51,14.42,{"$f":"AE3*9.4782","v":109.09408199999999},{"$f":"AF3*277.778","v":4005.5587600000003}]
[null,"Selected",4000,4.3874000000000004,1148.2,{"$f":"C4*D4+E4","v":18697.800000000003},null,null,null,null,null,134,"CAN","BC_Comox","CAN_BC_Comox.718930_CWEC",3177,31,49.62,4.5,{"$f":"R4*9.4782","v":470.30828399999996},{"$f":"S4*277.778","v":1250.0010000000002},null,null,null,50,"AUS","VIC Cape Otway Lighthouse","AUS_VIC.Cape.Otway.Lighthouse.948420_RMY",1625,152,2.4700000000000002,3.96,23.411154,1100.0008800000001]
[null,null,null,null,"Ratio",{"$f":"F4/F3","v":5.5949609503575806},null,null,null,null,null,45,"AUS","TAS Hobart-Ellerslie Road","AUS_TAS.Hobart-Ellerslie.Road.949700_RMY",2073,52,7.54,2.83,71.465627999999995,786.11174000000005,null,null,null,368,"FRA","Montpellier","FRA_Montpellier.076430_IWEC",1693,531,17.22,12.62,163.21460399999998,3505.55836]
[null,null,null,null,"Reference Savings",200,"kWh",null,null,null,null,689,"POL","Lebork","POL_Lebork.121250_IMGW",3739,65,72.67,4.17,688.78079400000001,1158.3342600000001,null,null,null,792,"USA","AL_Huntsville Intl AP-Jones Field","USA_AL_Huntsville.Intl.AP-Jones.Field.723230_TMY3",1846,948,25.83,19.37,244.82190599999996,5380.5598600000003]
[null,null,null,null,"Adjusted Savings",{"$f":"F5*F6","v":1118.992190071516},"kWh",null,null,null,null,131,"CAN","AB_Lethbridge","CAN_AB_Lethbridge.712430_CWEC",4430,127,82.44,7.32,781.38280799999995,2033.3349600000001,null,null,null,45,"AUS","TAS Hobart-Ellerslie Road","AUS_TAS.Hobart-Ellerslie.Road.949700_RMY",2073,52,7.54,2.83,71.465627999999995,786.11174000000005]
[null,null,null,null,"Ratio - prior method",{"$f":"C4/C3","v":8},null,null,null,null,null,50,"AUS","VIC Cape Otway Lighthouse","AUS_VIC.Cape.Otway.Lighthouse.948420_RMY",1625,152,2.4700000000000002,3.96,23.411154,1100.0008800000001,null,null,null,519,"ITA","Milan","ITA_Milan.160660_IWEC",2639,380,42.51,11.24,402.91828199999998,3122.2247200000002]
[null,null,null,null,"Prior method adj savings",{"$f":"F8*F6","v":1600},"kWh",null,null,null,null,186,"CAN","PQ_Montreal Intl AP","CAN_PQ_Montreal.Intl.AP.716270_CWEC",4493,234,108.52,7.79,1028.5742639999999,2163.8906200000001,null,null,null,752,"ROU","Galati","ROU_Galati.153100_IWEC",2962,408,53.57,11.74,507.74717399999997,3261.1137200000003]
[null,null,null,null,null,null,null,null,null,null,null,206,"CHL","Antofagasta","CHL_Antofagasta.854420_IWEC",598,236,0.53,8.66,5.0234459999999999,2405.5574800000004,null,null,null,143,"CAN","BC_Vancouver","CAN_BC_Vancouver.718920_CWEC",3020,5,46.1,4.58,436.94502,1272.22324]
[null,null,null,null,null,null,null,null,null,null,null,884,"USA","NY_Buffalo","USA_NY_Buffalo.725280_TMY2",3609,323,80.44,9.08,762.42640799999992,2522.22424,null,null,null,134,"CAN","BC_Comox","CAN_BC_Comox.718930_CWEC",3177,31,49.62,4.5,470.30828399999996,1250.0010000000002]
[null,null,null,null,null,null,null,null,null,null,null,519,"ITA","Milan","ITA_Milan.160660_IWEC",2639,380,42.51,11.24,402.91828199999998,3122.2247200000002,null,null,null,874,"USA","NE_Kearney Muni AWOS","USA_NE_Kearney.Muni.AWOS.725526_TMY3",3488,487,61.66,12.58,584.42581199999995,3494.4472400000004]
[null,null,null,null,null,null,null,null,null,null,null,752,"ROU","Galati","ROU_Galati.153100_IWEC",2962,408,53.57,11.74,507.74717399999997,3261.1137200000003,null,null,null,884,"USA","NY_Buffalo","USA_NY_Buffalo.725280_TMY2",3609,323,80.44,9.08,762.42640799999992,2522.22424]
[null,null,null,null,null,null,null,null,null,null,null,874,"USA","NE_Kearney Muni AWOS","USA_NE_Kearney.Muni.AWOS.725526_TMY3",3488,487,61.66,12.58,584.42581199999995,3494.4472400000004,null,null,null,689,"POL","Lebork","POL_Lebork.121250_IMGW",3739,65,72.67,4.17,688.78079400000001,1158.3342600000001]
[null,null,null,null,null,null,null,null,null,null,null,368,"FRA","Montpellier","FRA_Montpellier.076430_IWEC",1693,531,17.22,12.62,163.21460399999998,3505.55836,null,null,null,131,"CAN","AB_Lethbridge","CAN_AB_Lethbridge.712430_CWEC",4430,127,82.44,7.32,781.38280799999995,2033.3349600000001]
[null,null,null,null,null,null,null,null,null,null,null,512,"ITA","Genova","ITA_Genova.161200_IWEC",1348,653,11.51,14.42,109.09408199999999,4005.5587600000003,null,null,null,186,"CAN","PQ_Montreal Intl AP","CAN_PQ_Montreal.Intl.AP.716270_CWEC",4493,234,108.52,7.79,1028.5742639999999,2163.8906200000001]
[null,null,null,null,null,null,null,null,null,null,null,792,"USA","AL_Huntsville Intl AP-Jones Field","USA_AL_Huntsville.Intl.AP-Jones.Field.723230_TMY3",1846,948,25.83,19.37,244.82190599999996,5380.5598600000003,null,null,null,"Last row"]
[null,null,null,null,null,null,null,null,null,null,null,113,"BRA","Florianopolis","BRA_Florianopolis.838990_SWERA",201,1196,0.31,22.65,2.9382419999999998,6291.6716999999999]
[null,null,null,null,null,null,null,null,null,null,null,null,"CUB","Havana","CUB_Havana.782240_IWEC",10,2432,0.11,40.51,1.042602,11252.78678]
[null,null,null,null,null,null,null,null,null,null,null,292,"EGY","Luxor","EGY_Luxor.624050_ETMY",252,2728,0.69,56.69,6.5399579999999986,15747.23482]
[null,null,null,null,null,null,null,null,null,null,null,78,"AUS","WA Port Hedland Airport","AUS_WA.Port.Hedland.943120_IWEC",16,2764,0.13,43.45,1.2321659999999999,12069.454100000001]
[null,null,null,null,null,null,null,null,null,null,null,437,"IND","Kolkata","IND_Kolkata.428090_ISHRAE",11,3021,0.05,52.84,0.47391,14677.789520000002]
[null,null,null,null,null,null,null,null,null,null,null,1,"ARE","Abu Dhabi","ARE_Abu.Dhabi.412170_IWEC",24,3358,0.21,57.35,1.9904219999999997,15930.568300000001]
[null,null,null,null,null,null,null,null,null,null,null,616,"MDV","Male-Hulule Island","MDV_Male-Hulule.Island.435550_SWERA",0,3708,0,59.12,0,16422.235359999999]
[null,null,null,null,null,null,null,null,null,null,null,"Last row"]
[]
[]
[]
[]
[]
[]
[]
[]
[]
[]
[]
[]
[]
[]
[]
[]
[]
[]
[]
[]
[]
[]
[]
[]
[]
[]
[null,null,null,null,null,null,null,null,null,null,null,"Extra locations"]
[null,null,null,null,null,null,null,null,null,null,null,520,"ITA","Milano-Linate",null,2454,414]
[null,null,null,null,null,null,null,null,null,null,null,324,"ESP","Murcia",null,1040,652]
[null,null,null,null,null,null,null,null,null,null,null,759,"RUS","Omsk",null,6099,196]
[null,null,null,null,null,null,null,null,null,null,null,34,"AUS","QLD Rockhampton Aero",null,135,1620]
[null,null,null,null,null,null,null,null,null,null,null,642,"NZL","Canterbury Christchurch",null,2441,58]
[null,null,null,null,null,null,null,null,null,null,null,609,"LKA","Puttalam",null,0,3424]
[null,null,null,null,null,null,null,null,null,null,null,907,"USA","TN_Chattanooga",null,1929,876]
[null,null,null,null,null,null,null,null,null,null,null,387,"GTM","Flores",null,1,2502]
[null,null,null,null,null,null,null,null,null,null,null,613,"MAR","Casablanca Nouasser",null,829,582]
[null,null,null,null,null,null,null,null,null,null,null,227,"CHN","Jiangsu Dongtai",null,2092,922]
[null,null,null,null,null,null,null,null,null,null,null,654,"NZL","Waikato-Hamilton HN",null,1710,64]
[null,null,null,null,null,null,null,null,null,null,null,246,"CUB","Camaguey",null,7,2463]
[null,null,null,null,null,null,null,null,null,null,null,238,"CHN","Sichuan Barkam",null,3442,13]
[null,null,null,null,null,null,null,null,null,null,null,698,"POL","Olsztyn",null,4106,72]
[null,null,null,null,null,null,null,null,null,null,null,515,"ITA","Lecce",null,1294,630]
[null,null,null,null,null,null,null,null,null,null,null,281,"EGY","Alexandria",null,416,1296]
[null,null,null,null,null,null,null,null,null,null,null,232,"CHN","Nei Mongol Abag Qi Hot",null,6110,248]
[null,null,null,null,null,null,null,null,null,null,null,808,"USA","CO_Boulder",null,3322,360]
[null,null,null,null,null,null,null,null,null,null,null,681,"POL","Kolo",null,3522,91]
[null,null,null,null,null,null,null,null,null,null,null,921,"USA","WI_Green Bay",null,4441,256]
[null,null,null,null,null,null,null,null,null,null,null,289,"EGY","Hurghada",null,88,2723]
[null,null,null,null,null,null,null,null,null,null,null,519,"ITA","Milan",null,2639,380]
[null,null,null,null,null,null,null,null,null,null,null,930,"ZAF","Johannesburg",null,1052,267]
[null,null,null,null,null,null,null,null,null,null,null,471,"IRL","Clones",null,3252,3]
[null,null,null,null,null,null,null,null,null,null,null,899,"USA","RI_Pawtucket AWOS",null,3474,296]
[null,null,null,null,null,null,null,null,null,null,null,625,"MYS","Kota Baharu",null,0,3284]
[null,null,null,null,null,null,null,null,null,null,null,838,"USA","IA_Sioux City",null,3664,512]
[null,null,null,null,null,null,null,null,null,null,null,186,"CAN","PQ_Montreal Intl AP",null,4493,234]
[null,null,null,null,null,null,null,null,null,null,null,498,"ITA","Brindisi",null,1151,834]
[null,null,null,null,null,null,null,null,null,null,null,184,"CAN","PQ_Lake Eon",null,7384,8]
[null,null,null,null,null,null,null,null,null,null,null,638,"NZL","Auckland-Auckland AK",null,1165,166]
[null,null,null,null,null,null,null,null,null,null,null,148,"CAN","MB_Winnipeg",null,5754,197]
[null,null,null,null,null,null,null,null,null,null,null,281,"EGY","Alexandria",null,416,1296]
[null,null,null,null,null,null,null,null,null,null,null,273,"DEU","Koln",null,3029,80]
[null,null,null,null,null,null,null,null,null,null,null,153,"CAN","NF_Gander",null,5099,25]
[null,null,null,null,null,null,null,null,null,null,null,897,"USA","PA_Lancaster AP",null,2641,543]
[null,null,null,null,null,null,null,null,null,null,null,716,"POL","Szczecinek",null,3742,62]
[null,null,null,null,null,null,null,null,null,null,null,865,"USA","MS_Columbus AFB",null,1829,1146]
[null,null,null,null,null,null,null,null,null,null,null,369,"FRA","Nancy",null,2978,117]
[null,null,null,null,null,null,null,null,null,null,null,246,"CUB","Camaguey",null,7,2463]
[null,null,null,null,null,null,null,null,null,null,null,505,"ITA","Cozzo Spadaro",null,838,874]
[null,null,null,null,null,null,null,null,null,null,null,152,"CAN","NF_Battle Harbour","CAN_NF_Battle.Harbour.718170_CWEC",6463,0]
[null,null,null,null,null,null,null,null,null,null,null,245,"CUB","Bahia Honda","CUB_Bahia.Honda.783180_SWERA",3,2575]
[null,null,null,null,null,null,null,null,null,null,null,92,"BGD","Ishurdi","BGD_Ishurdi.419070_SWERA",44,2612]
[null,null,null,null,null,null,null,null,null,null,null,423,"IND","Gorakhpur","IND_Gorakhpur.423790_ISHRAE",172,2732]
[null,null,null,null,null,null,null,null,null,null,null,578,"KEN","Lamu-Manda Island","KEN_Lamu-Manda.Island.637720_SWERA",0,3322]
[null,null,null,null,null,null,null,null,null,null,null,484,"ISR","Jerusalem-Atarot AP","ISR_Jerusalem-Atarot.AP.401840_MSI",1364,639]
[null,null,null,null,null,null,null,null,null,null,null,603,"LKA","Batticaloa","LKA_Batticaloa.434360_SWERA",0,3651]
[null,null,null,null,null,null,null,null,null,null,null,608,"LKA","Nuwara Eliya","LKA_Nuwara.Eliya.434730_SWERA",947,3]
[null,null,null,null,null,null,null,null,null,null,null,66,"AUS","WA Kalamunda-Bickley","AUS_WA.Kalamunda-Bickley.956100_RMY",1171,468]

{"sheet":"WeatherData","index":7,"n_rows":1003,"n_cols":105,"rows_kept":1003,"cut":false,"hidden":true,"merged":[]}
[null,null,"HDD","CDD",null,null,null,null,null,null,null,"Formula for list =IFERROR(INDEX(wCity, MATCH(MIN(IF((COUNTIF(L$6:L7, wCity)=0)*(wCountry=$L$6), 1, MAX((COUNTIF(wCity, \"<\"&wCity)+1)*2))*(COUNTIF(wCity, \"<\"&wCity)+1)), IF(wCountry=$L$6,COUNTIF(wCity, \"<\"&wCity)+1,\"\"), 0)),\"\")"]
[null,null,null,null,null,null,null,null,"Selected:",25,1]
[null,"Selected City:",{"$f":"SUMPRODUCT(--($A$6:$A$1003=$J$3)*--($B$6:$B$1003=$K$3),C$6:C$1003)","v":705},{"$f":"SUMPRODUCT(--($A$6:$A$1003=$J$3)*--($B$6:$B$1003=$K$3),D$6:D$1003)","v":30},null,null,null,null,"Name:",{"$f":"INDEX(CountryList,J2)","v":"ETH"},{"$f":"IF(K2=0,\"None\",INDEX(CityList,K2))","v":"Addis Ababa-Bole"},{"$f":"MATCH(L5,'Country Parameters'!$F$4:$F$198,0)","v":3},{"$f":"MATCH(M5,'Country Parameters'!$F$4:$F$198,0)","v":7},{"$f":"MATCH(N5,'Country Parameters'!$F$4:$F$198,0)","v":9},{"$f":"MATCH(O5,'Country Parameters'!$F$4:$F$198,0)","v":10},{"$f":"MATCH(P5,'Country Parameters'!$F$4:$F$198,0)","v":14},{"$f":"MATCH(Q5,'Country Parameters'!$F$4:$F$198,0)","v":16},{"$f":"MATCH(R5,'Country Parameters'!$F$4:$F$198,0)","v":17},{"$f":"MATCH(S5,'Country Parameters'!$F$4:$F$198,0)","v":18},{"$f":"MATCH(T5,'Country Parameters'!$F$4:$F$198,0)","v":21},{"$f":"MATCH(U5,'Country Parameters'!$F$4:$F$198,0)","v":22},{"$f":"MATCH(V5,'Country Parameters'!$F$4:$F$198,0)","v":24},{"$f":"MATCH(W5,'Country Parameters'!$F$4:$F$198,0)","v":25},{"$f":"MATCH(X5,'Country Parameters'!$F$4:$F$198,0)","v":26},{"$f":"MATCH(Y5,'Country Parameters'!$F$4:$F$198,0)","v":32},{"$f":"MATCH(Z5,'Country Parameters'!$F$4:$F$198,0)","v":36},{"$f":"MATCH(AA5,'Country Parameters'!$F$4:$F$198,0)","v":37},{"$f":"MATCH(AB5,'Country Parameters'!$F$4:$F$198,0)","v":38},{"$f":"MATCH(AC5,'Country Parameters'!$F$4:$F$198,0)","v":45},{"$f":"MATCH(AD5,'Country Parameters'!$F$4:$F$198,0)","v":46},{"$f":"MATCH(AE5,'Country Parameters'!$F$4:$F$198,0)","v":47},{"$f":"MATCH(AF5,'Country Parameters'!$F$4:$F$198,0)","v":48},{"$f":"MATCH(AG5,'Country Parameters'!$F$4:$F$198,0)","v":52},{"$f":"MATCH(AH5,'Country Parameters'!$F$4:$F$198,0)","v":53},{"$f":"MATCH(AI5,'Country Parameters'!$F$4:$F$198,0)","v":54},{"$f":"MATCH(AJ5,'Country Parameters'!$F$4:$F$198,0)","v":58},{"$f":"MATCH(AK5,'Country Parameters'!$F$4:$F$198,0)","v":59},{"$f":"MATCH(AL5,'Country Parameters'!$F$4:$F$198,0)","v":60},{"$f":"MATCH(AM5,'Country Parameters'!$F$4:$F$198,0)","v":61},{"$f":"MATCH(AN5,'Country Parameters'!$F$4:$F$198,0)","v":65},{"$f":"MATCH(AO5,'Country Parameters'!$F$4:$F$198,0)","v":66},{"$f":"MATCH(AP5,'Country Parameters'!$F$4:$F$198,0)","v":67},{"$f":"MATCH(AQ5,'Country Parameters'!$F$4:$F$198,0)","v":69},{"$f":"MATCH(AR5,'Country Parameters'!$F$4:$F$198,0)","v":75},{"$f":"MATCH(AS5,'Country Parameters'!$F$4:$F$198,0)","v":76},{"$f":"MATCH(AT5,'Country Parameters'!$F$4:$F$198,0)","v":77},{"$f":"MATCH(AU5,'Country Parameters'!$F$4:$F$198,0)","v":78},{"$f":"MATCH(AV5,'Country Parameters'!$F$4:$F$198,0)","v":80},{"$f":"MATCH(AW5,'Country Parameters'!$F$4:$F$198,0)","v":82},{"$f":"MATCH(AX5,'Country Parameters'!$F$4:$F$198,0)","v":83},{"$f":"MATCH(AY5,'Country Parameters'!$F$4:$F$198,0)","v":84},{"$f":"MATCH(AZ5,'Country Parameters'!$F$4:$F$198,0)","v":86},{"$f":"MATCH(BA5,'Country Parameters'!$F$4:$F$198,0)","v":88},{"$f":"MATCH(BB5,'Country Parameters'!$F$4:$F$198,0)","v":89},{"$f":"MATCH(BC5,'Country Parameters'!$F$4:$F$198,0)","v":91},{"$f":"MATCH(BD5,'Country Parameters'!$F$4:$F$198,0)","v":92},{"$f":"MATCH(BE5,'Country Parameters'!$F$4:$F$198,0)","v":94},{"$f":"MATCH(BF5,'Country Parameters'!$F$4:$F$198,0)","v":101},{"$f":"MATCH(BG5,'Country Parameters'!$F$4:$F$198,0)","v":103},{"$f":"MATCH(BH5,'Country Parameters'!$F$4:$F$198,0)","v":106},{"$f":"MATCH(BI5,'Country Parameters'!$F$4:$F$198,0)","v":108},{"$f":"MATCH(BJ5,'Country Parameters'!$F$4:$F$198,0)","v":109},{"$f":"MATCH(BK5,'Country Parameters'!$F$4:$F$198,0)","v":112},{"$f":"MATCH(BL5,'Country Parameters'!$F$4:$F$198,0)","v":115},{"$f":"MATCH(BM5,'Country Parameters'!$F$4:$F$198,0)","v":119},{"$f":"MATCH(BN5,'Country Parameters'!$F$4:$F$198,0)","v":121},{"$f":"MATCH(BO5,'Country Parameters'!$F$4:$F$198,0)","v":125},{"$f":"MATCH(BP5,'Country Parameters'!$F$4:$F$198,0)","v":126},{"$f":"MATCH(BQ5,'Country Parameters'!$F$4:$F$198,0)","v":127},{"$f":"MATCH(BR5,'Country Parameters'!$F$4:$F$198,0)","v":128},{"$f":"MATCH(BS5,'Country Parameters'!$F$4:$F$198,0)","v":131},{"$f":"MATCH(BT5,'Country Parameters'!$F$4:$F$198,0)","v":133},{"$f":"MATCH(BU5,'Country Parameters'!$F$4:$F$198,0)","v":134},{"$f":"MATCH(BV5,'Country Parameters'!$F$4:$F$198,0)","v":137},{"$f":"MATCH(BW5,'Country Parameters'!$F$4:$F$198,0)","v":138},{"$f":"MATCH(BX5,'Country Parameters'!$F$4:$F$198,0)","v":139},{"$f":"MATCH(BY5,'Country Parameters'!$F$4:$F$198,0)","v":140},{"$f":"MATCH(BZ5,'Country Parameters'!$F$4:$F$198,0)","v":141},{"$f":"MATCH(CA5,'Country Parameters'!$F$4:$F$198,0)","v":143},{"$f":"MATCH(CB5,'Country Parameters'!$F$4:$F$198,0)","v":144},{"$f":"MATCH(CC5,'Country Parameters'!$F$4:$F$198,0)","v":152},{"$f":"MATCH(CD5,'Country Parameters'!$F$4:$F$198,0)","v":153},{"$f":"MATCH(CE5,'Country Parameters'!$F$4:$F$198,0)","v":154},{"$f":"MATCH(CF5,'Country Parameters'!$F$4:$F$198,0)","v":157},{"$f":"MATCH(CG5,'Country Parameters'!$F$4:$F$198,0)","v":158},{"$f":"MATCH(CH5,'Country Parameters'!$F$4:$F$198,0)","v":159},{"$f":"MATCH(CI5,'Country Parameters'!$F$4:$F$198,0)","v":162},{"$f":"MATCH(CJ5,'Country Parameters'!$F$4:$F$198,0)","v":164},{"$f":"MATCH(CK5,'Country Parameters'!$F$4:$F$198,0)","v":165},{"$f":"MATCH(CL5,'Country Parameters'!$F$4:$F$198,0)","v":169},{"$f":"MATCH(CM5,'Country Parameters'!$F$4:$F$198,0)","v":170},{"$f":"MATCH(CN5,'Country Parameters'!$F$4:$F$198,0)","v":171},{"$f":"MATCH(CO5,'Country Parameters'!$F$4:$F$198,0)","v":174},{"$f":"MATCH(CP5,'Country Parameters'!$F$4:$F$198,0)","v":179},{"$f":"MATCH(CQ5,'Country Parameters'!$F$4:$F$198,0)","v":180},{"$f":"MATCH(CR5,'Country Parameters'!$F$4:$F$198,0)","v":184},{"$f":"MATCH(CS5,'Country Parameters'!$F$4:$F$198,0)","v":185},{"$f":"MATCH(CT5,'Country Parameters'!$F$4:$F$198,0)","v":186},{"$f":"MATCH(CU5,'Country Parameters'!$F$4:$F$198,0)","v":187},{"$f":"MATCH(CV5,'Country Parameters'!$F$4:$F$198,0)","v":188},{"$f":"MATCH(CW5,'Country Parameters'!$F$4:$F$198,0)","v":189},{"$f":"MATCH(CX5,'Country Parameters'!$F$4:$F$198,0)","v":191},{"$f":"MATCH(CY5,'Country Parameters'!$F$4:$F$198,0)","v":192},{"$f":"MATCH(CZ5,'Country Parameters'!$F$4:$F$198,0)","v":195}]
[null,null,null,null,null,null,null,null,null,null,null,"Algeria","Argentina","Australia","Austria","Bangladesh","Belarus","Belgium","Belize","Bolivia","Bosnia and Herzegovina","Brazil","Brunei Darussalam","Bulgaria","Canada","Chile","China","Colombia","Cuba","Cyprus","Czech Republic","Denmark","Ecuador","Egypt","El Salvador","Ethiopia","Fiji","Finland","France","Germany","Ghana","Greece","Guatemala","Honduras","Hungary","Iceland","India","Iran","Ireland","Israel","Italy","Japan","Kazakhstan","Kenya","Korea, North","Korea, South","Kuwait","Libya","Lithuania","Madagascar","Malaysia","Maldives","Marshall Islands","Mexico","Mongolia","Morocco","Nepal","Netherlands","New Zealand","Nicaragua","Norway","Pakistan","Palau","Paraguay","Peru","Philippines","Poland","Portugal","Romania","Russia","Saudi Arabia","Senegal","Serbia","Singapore","Slovakia","Slovenia","South Africa","Spain","Sri Lanka","Sweden","Switzerland","Syria","Thailand","Tunisia","Turkey","Ukraine","United Arab Emirates","United Kingdom","United States","Uruguay","Uzbekistan","Venezuela","Vietnam","Zimbabwe","South Africa"]
["Country","City","Heating Degree Days","Cooling Degree Days","Base 18 deg C, from ",null,null,null,null,null,null,"DZA","ARG","AUS","AUT","BGD","BLR","BEL","BLZ","BOL","BIH","BRA","BRN","BGR","CAN","CHL","CHN","COL","CUB","CYP","CZE","DNK","ECU","EGY","SLV","ETH","FJI","FIN","FRA","DEU","GHA","GRC","GTM","HND","HUN","ISL","IND","IRN","IRL","ISR","ITA","JPN","KAZ","KEN","PRK","KOR","KWT","LBY","LTU","MDG","MYS","MDV","MHL","MEX","MNG","MAR","NPL","NLD","NZL","NIC","NOR","PAK","PLW","PRY","PER","PHL","POL","PRT","ROU","RUS","SAU","SEN","SRB","SGP","SVK","SVN","ZAF","ESP","LKA","SWE","CHE","SYR","THA","TUN","TUR","UKR","ARE","GBR","USA","URY","UZB","VEN","VNM","ZWE","Zimbabwe"]
["ARE","Abu Dhabi",24,3358,null,null,null,null,null,null,{"$f":"MATCH(J3,$L$5:$CZ$5,0)","v":25},"Algiers","Buenos Aires","ACT Canberra","Graz","Bogra","Minsk","Brussels","Belize","La Paz","Banja Luka","Belem","Bandar Seri Begawan","Plovdiv","AB_Edmonton","Antofagasta","Anhui Anqing","Bogota","Bahia Honda","Larnaca","Ostrava","Copenhagen","Quito","Al Minya","Acajutla","Addis Ababa-Bole","Nadi","Helsinki","Bordeaux","Berlin","Accra","Andravida","Flores","Amapala","Debrecen","Reykjavik","Ahmedabad","Bandar Abass","Belmullet","Beer Sheva","Alghero","Kagoshima","Semipalatinsk","Eldoret","Chongjin","Inchon","KISR Coastal Station","Tripoli","Kaunas","Antananarivo","George Town","Gan Island","Kwajalein Atoll","Acapulco","Ulaanbataar","Casablanca Nouasser","Kathmandu","Amsterdam","Auckland Auckland","Chinandega","Bergen","Karachi","Koror Island","Asuncion","Arequipa","Manila","Bialystok","Braganca","Bucharest","Arkhangelsk","Riyadh","Dakar","Belgrade","Singapore","Bratislava","Ljubljana","Cape Town","Albacete","Anuradhapura","Goteborg Landvetter","Geneva","Damascus","Bangkok","Tunis","Ankara","Kiev","Abu Dhabi","Aberdeen Dyce","AK_Anchorage","Montevideo","Tashkent","Caracas","Hanoi","Harare"]
["ARG","Buenos Aires",1189,663,null,null,null,null,null,null,null,null,null,"ACT Canberra Airport","Innsbruck","Chittagong-Patenga",null,"Oostende",null,null,null,"Belem-Val de Caes",null,"Sofia","AB_Fort McMurray","Concepcion","Beijing Beijing",null,"Camaguey",null,"Prague",null,null,"Alexandria","San Salvador-Ilopango","Awassa",null,"Tampere","Brest","Bremen",null,"Athens","Guatemala-La Aurora","Catacamas","Szombathely",null,"Akola","Esfahan","Birr","Eilat","Ancona","Matsumoto","","Embu","Haeju","Kangnung","Kuwait Intl AP",null,null,null,"Kota Baharu","Male-Hulule Island",null,"Mexico City","Ulaangom",null,"Surkhet","Beek","Auckland-Auckland AK","Managua-Augusto CES","Oslo Fornebu",null,null,null,"Cuzco",null,"Bielsko Biala","Coimbra","Cluj-Napoca","Chita",null,null,"Podgorica",null,"Kosice",null,"Johannesburg","Alicante","Batticaloa","Karlstad",null,null,null,null,"Istanbul","Odessa",null,"Aughton","AK_Fairbanks"]
["AUS","ACT Canberra",2120,195,null,null,null,null,null,null,null,null,null,"NSW Armidale Airport","Linz","Coxs Bazar",null,"Saint Hubert",null,null,null,"Belo Horizonte-Pampulha",null,"Varna","AB_Grande Prairie","Easter Island","Chongqing Chongqing Shapingba",null,"Casa Blanca",null,null,null,null,"Aswan",null,"Bahar Dar",null,null,"Clermont-Ferrand","Dusseldorf",null,"Thessaloniki","Huehuetenango","Choluteca",null,null,"Allahabad","Shiraz","Clones","Jerusalem","Ancona-Falconara","Miho Civ JASDF",null,"Garissa","Pyongyang","Kwangju",null,null,null,null,"Kuala Lumpur",null,null,"Veracruz",null,null,null,"Groningen","Bay of Plenty-Tauranga BP","Rivas",null,null,null,null,"Lima",null,"Bydgoszcz","Evora","Constanta","Ekaterinburg",null,null,null,null,null,null,null,"Almeria","Colombo-Katunayake","Kiruna",null,null,null,null,"Izmir",null,null,"Belfast","AL_Birmingham"]
["AUS","ACT Canberra Airport",2129,217,null,null,null,"Last row ->",null,null,null,null,null,"NSW Cabramurra","Salzburg","Dhaka",null,null,null,null,null,"Boa Vista",null,null,"AB_Lethbridge","Punta Arenas","Fujian Congwu",null,"Cienfuegos",null,null,null,null,"Asyut",null,"Combolcha",null,null,"Dijon","Frankfurt am Main",null,null,"Puerto Barrios","La Ceiba-Goloson",null,null,"Amritsar","Tabriz","Dublin","Jerusalem-Atarot AP","Aviano","Nagoya",null,"Kisii",null,"Ulsan",null,null,null,null,"Kuching",null,null,null,null,null,null,null,"Canterbury Christchurch",null,null,null,null,null,null,null,"Chojnice","Faro","Craiova","Irkutsk",null,null,null,null,null,null,null,"Avila","Colombo-Ratmalana","Ostersund Froson",null,null,null,null,null,null,null,"Birmingham","AL_Huntsville Intl AP-Jones Field"]
["AUS","NSW Armidale Airport",1889,204,null,null,null,null,null,null,null,null,null,"NSW Cobar","Vienna Schwechat","Ishurdi",null,null,null,null,null,"Bom Jesus da Lapa",null,null,"AB_Medicine Hat","Santiago","Gansu Dunhuang",null,"Guantanamo Bay NAS",null,null,null,null,"Cairo",null,"Debre Marcos",null,null,"Lyon","Hamburg",null,null,"San Jose","La Mesa-San Pedro Sula",null,null,"Aurangabad","Tehran-Mehrabad","Kilkenny","Tel Aviv-Bet Dagan","Bari-Palese Macchie","Osaka",null,"Kisumu",null,null,null,null,null,null,null,null,null,null,null,null,null,null,"Canterbury-Christchurch CC",null,null,null,null,null,null,null,"Czestochowa","Funchal Madeira-Islands","Galati","Moscow",null,null,null,null,null,null,null,"Badajoz","Hambantota","Stockholm Arlanda",null,null,null,null,null,null,null,"Hemsby","AL_Montgomery"]
["AUS","NSW Cabramurra",3586,49,null,null,null,null,null,null,null,null,null,"NSW Coffs Harbour",null,"Jessore",null,null,null,null,null,"Brasilia",null,null,"BC_Abbotsford",null,"Guangdong Dianbai",null,"Havana",null,null,null,null,"Cairo Intl Airport",null,"Dire Dawa",null,null,"Marseille","Koln",null,null,null,"Puerto Lempira",null,null,"Bangalore","Yazd","Valentia Observatory",null,"Bergamo-Orio al Serio","Sapporo",null,"Kitale",null,null,null,null,null,null,null,null,null,null,null,null,null,null,"Central Otago-Lauder OC",null,null,null,null,null,null,null,"Elblag","Lajes","Timisoara","Omsk",null,null,null,null,null,null,null,"Barcelona","Kankasanturai",null,null,null,null,null,null,null,null,"Jersey Channel Islands","AR_Bentonville AWOS"]
["AUS","NSW Cobar",970,1152,null,null,null,null,null,null,null,null,null,"NSW Dubbo Airport",null,"Rangpur",null,null,null,null,null,"Campo Grande",null,null,"BC_Comox",null,"Guangdong Shenzhen",null,"Havana-Jose Marti",null,null,null,null,"El Arish",null,"Gondar",null,null,"Montpellier","Mannheim",null,null,null,"Santa Rosa de Copan",null,null,"Barmer",null,null,null,"Bologna-Borgo Panigale","Shimonoseki",null,"Lamu-Manda Island",null,null,null,null,null,null,null,null,null,null,null,null,null,null,"East Coast-Napier EC",null,null,null,null,null,null,null,"Gdansk Port Polnocny","Lisboa",null,"Saint-Petersburg",null,null,null,null,null,null,null,"Bilbao","Nuwara Eliya",null,null,null,null,null,null,null,null,"Leuchars","AR_Fayetteville-Drake Field"]
["AUS","NSW Coffs Harbour",551,721,null,null,null,null,null,null,null,null,null,"NSW Mascot-Sydney Airport",null,"Sylhet",null,null,null,null,null,"Cuiaba-Marechal Ron",null,null,"BC_Fort St John",null,"Guangxi Zhuang Baise",null,"La Bajada",null,null,null,null,"Helwan",null,"Jimma",null,null,"Nancy","Munich",null,null,null,"Tela",null,null,"Belgaum",null,null,null,"Bolzano","Tokyo Hyakuri",null,"Lodwar",null,null,null,null,null,null,null,null,null,null,null,null,null,null,"Manawatu-Paraparaumu MW",null,null,null,null,null,null,null,"Gorzow Wlkp","Porto",null,"Samara",null,null,null,null,null,null,null,"Burgos","Puttalam",null,null,null,null,null,null,null,null,"London Gatwick","AR_Little Rock"]
["AUS","NSW Dubbo Airport",1221,603,null,null,null,null,null,null,null,null,null,"NSW Moree Aero",null,null,null,null,null,null,null,"Curitiba-Afonso Pen",null,null,"BC_Kamloops",null,"Guizhou Bijie",null,"La Fe",null,null,null,null,"Hurghada",null,"Metehara",null,null,"Nantes","Stuttgart",null,null,null,null,null,null,"Bhagalpur",null,null,null,"Bonifati","Tosashimizu",null,"Makindu",null,null,null,null,null,null,null,null,null,null,null,null,null,null,"Nelson Marlborough-Nelson NM",null,null,null,null,null,null,null,"Hel",null,null,"Yakutsk",null,null,null,null,null,null,null,"Caceres","Trincomalee",null,null,null,null,null,null,null,null,"Oban","AZ_Flagstaff"]
["AUS","NSW Mascot-Sydney Airport",728,586,null,null,null,null,null,null,null,null,null,"NSW Nowra RAN Air Station",null,null,null,null,null,null,null,"Florianopolis",null,null,"BC_Port Hardy",null,"Hainan Dongfang",null,"Paso Real de San Diego",null,null,null,null,"Ismailia",null,null,null,null,"Nice",null,null,null,null,null,null,null,"Bhopal",null,null,null,"Brescia-Ghedi","",null,"Malindi",null,null,null,null,null,null,null,null,null,null,null,null,null,null,"Northland-Kaitaia NL",null,null,null,null,null,null,null,"Jelenia Gora",null,null,null,null,null,null,null,null,null,null,"Castellon","",null,null,null,null,null,null,null,null,null,"AZ_Grand Canyon National Park AP"]
["AUS","NSW Moree Aero",870,1144,null,null,null,null,null,null,null,null,null,"NSW Orange Airport",null,null,null,null,null,null,null,"Fortaleza-Pinto Mar",null,null,"BC_Prince George",null,"Hebei Fengning",null,"Pinar del Rio",null,null,null,null,"Kharga",null,null,null,null,"Paris Orly",null,null,null,null,null,null,null,"Bhubneshwar",null,null,null,"Brindisi",null,null,"Mandera",null,null,null,null,null,null,null,null,null,null,null,null,null,null,"Otago-Dunedin DN",null,null,null,null,null,null,null,"Kalisz",null,null,null,null,null,null,null,null,null,null,"Ceuta",null,null,null,null,null,null,null,null,null,null,"AZ_Tucson"]
["AUS","NSW Nowra RAN Air Station",1121,373,null,null,null,null,null,null,null,null,null,"NSW Richmond RAAF",null,null,null,null,null,null,null,"Jacareacanga",null,null,"BC_Prince Rupert",null,"Heilongjiang Anda",null,"Playa Giron",null,null,null,null,"Luxor",null,null,null,null,"Strasbourg",null,null,null,null,null,null,null,"Bikaner",null,null,null,"Cagliari-Elmas",null,null,"Marsabit",null,null,null,null,null,null,null,null,null,null,null,null,null,null,"Queenstown Lakes-Queenstown QL",null,null,null,null,null,null,null,"Kasprowy Wierch",null,null,null,null,null,null,null,null,null,null,"Ciudad Real",null,null,null,null,null,null,null,null,null,null,"CA_Fresno"]
["AUS","NSW Orange Airport",2601,54,null,null,null,null,null,null,null,null,null,"NSW Sydney",null,null,null,null,null,null,null,"Manaus",null,null,"BC_Sandspit",null,"Henan Anyang",null,"Puerto Padre",null,null,null,null,null,null,null,null,null,null,null,null,null,null,null,null,null,"Calcutta",null,null,null,"Campobasso",null,null,"Meru",null,null,null,null,null,null,null,null,null,null,null,null,null,null,"Rotorua-Rotorua RR",null,null,null,null,null,null,null,"Katowice",null,null,null,null,null,null,null,null,null,null,"Cordoba",null,null,null,null,null,null,null,null,null,null,"CA_Long Beach"]
["AUS","NSW Richmond RAAF",1036,563,null,null,null,null,null,null,null,null,null,"NSW Thredbo Village",null,null,null,null,null,null,null,"Petrolina",null,null,"BC_Smithers",null,"Hong Kong SAR",null,"Punta de Maisi",null,null,null,null,null,null,null,null,null,null,null,null,null,null,null,null,null,"Chennai",null,null,null,"Capo Bellavista",null,null,"Mombasa-Moi",null,null,null,null,null,null,null,null,null,null,null,null,null,null,"Southland-Invercargill IN",null,null,null,null,null,null,null,"Ketrzyn",null,null,null,null,null,null,null,null,null,null,"Cuenca",null,null,null,null,null,null,null,null,null,null,"CA_Los Angeles Intl AP"]
["AUS","NSW Sydney",687,634,null,null,null,null,null,null,null,null,null,"NSW Wagga Wagga",null,null,null,null,null,null,null,"Porto Nacional",null,null,"BC_Summerland",null,"Hubei Exi",null,"Sancti Spiritus",null,null,null,null,null,null,null,null,null,null,null,null,null,null,null,null,null,"Chennai-Madras",null,null,null,"Capo Palinuro",null,null,"Moyale",null,null,null,null,null,null,null,null,null,null,null,null,null,null,"Taranaki-New Plymouth NP",null,null,null,null,null,null,null,"Kielce",null,null,null,null,null,null,null,null,null,null,"Gerona",null,null,null,null,null,null,null,null,null,null,"CA_Monterey NAF"]
["AUS","NSW Thredbo Village",3235,30,null,null,null,null,null,null,null,null,null,"NSW Williamtown RAAF",null,null,null,null,null,null,null,"Porto Velho",null,null,"BC_Vancouver",null,"Hunan Changde",null,"Santiago de Cuba",null,null,null,null,null,null,null,null,null,null,null,null,null,null,null,null,null,"Chirtadurg",null,null,null,"Catania-Fontanarossa",null,null,"Nairobi",null,null,null,null,null,null,null,null,null,null,null,null,null,null,"Taupo King Country-Turangi TP",null,null,null,null,null,null,null,"Klodzko",null,null,null,null,null,null,null,null,null,null,"Granada",null,null,null,null,null,null,null,null,null,null,"CA_Sacramento"]
["AUS","NSW Wagga Wagga",1593,541,null,null,null,null,null,null,null,null,null,"NT Alice Springs Airport",null,null,null,null,null,null,null,"Recife",null,null,"BC_Victoria",null,"Jiangsu Dongtai",null,"Saua la Grande",null,null,null,null,null,null,null,null,null,null,null,null,null,null,null,null,null,"Dehradun",null,null,null,"Catania-Sigonella",null,null,"Nairobi-Dagoretti",null,null,null,null,null,null,null,null,null,null,null,null,null,null,"Waikato-Hamilton HN",null,null,null,null,null,null,null,"Kolo",null,null,null,null,null,null,null,null,null,null,"Guadalajara",null,null,null,null,null,null,null,null,null,null,"CA_San Diego"]
["AUS","NSW Williamtown RAAF",827,592,null,null,null,null,null,null,null,null,null,"NT Darwin",null,null,null,null,null,null,null,"Recife-Guararapes",null,null,"MB_Brandon",null,"Jiangxi Ganzhou",null,"Union de Reyes",null,null,null,null,null,null,null,null,null,null,null,null,null,null,null,null,null,"Dibrugarh",null,null,null,"Cozzo Spadaro",null,null,"Nairobi-Kenyatta",null,null,null,null,null,null,null,null,null,null,null,null,null,null,"Wairarapa-Masterton WI",null,null,null,null,null,null,null,"Kolobrzeg",null,null,null,null,null,null,null,null,null,null,"Huelva",null,null,null,null,null,null,null,null,null,null,"CA_San Francisco"]
["AUS","NT Alice Springs Airport",665,1816,null,null,null,null,null,null,null,null,null,"NT Darwin Airport",null,null,null,null,null,null,null,"Rio de Janeiro-Santos Dumont",null,null,"MB_Churchill",null,"Jilin Baicheng",null,"Varadero",null,null,null,null,null,null,null,null,null,null,null,null,null,null,null,null,null,"Gorakhpur",null,null,null,"Crotone",null,null,"Nairobi-Wilson",null,null,null,null,null,null,null,null,null,null,null,null,null,null,"Wellington Wellington",null,null,null,null,null,null,null,"Koszalin",null,null,null,null,null,null,null,null,null,null,"Huesca",null,null,null,null,null,null,null,null,null,null,"CA_Santa Barbara Muni AP"]
["AUS","NT Darwin",0,3355,null,null,null,null,null,null,null,null,null,"NT Tennant Creek",null,null,null,null,null,null,null,"Salvador",null,null,"MB_The Pas",null,"Kinjiang Uygar Kashi",null,null,null,null,null,null,null,null,null,null,null,null,null,null,null,null,null,null,null,"Guwahati",null,null,null,"Enna",null,null,"Nakuru",null,null,null,null,null,null,null,null,null,null,null,null,null,null,"Wellington-Wellington WN",null,null,null,null,null,null,null,"Krakow",null,null,null,null,null,null,null,null,null,null,"Jaen",null,null,null,null,null,null,null,null,null,null,"CO_Boulder"]
["AUS","NT Darwin Airport",0,3409,null,null,null,null,null,null,null,null,null,"QLD Amberley",null,null,null,null,null,null,null,"Santa Maria",null,null,"MB_Winnipeg",null,"Liaoning Chaoyang",null,null,null,null,null,null,null,null,null,null,null,null,null,null,null,null,null,null,null,"Gwalior",null,null,null,"Firenze-Peretola",null,null,"Narok",null,null,null,null,null,null,null,null,null,null,null,null,null,null,"West Coast-Hokitika WC",null,null,null,null,null,null,null,"Krosno",null,null,null,null,null,null,null,null,null,null,"La Coruna",null,null,null,null,null,null,null,null,null,null,"CO_Colorado Springs"]
["AUS","NT Tennant Creek",53,2957,null,null,null,null,null,null,null,null,null,"QLD Brisbane",null,null,null,null,null,null,null,"Sao Paulo",null,null,"NB_Fredericton",null,"Nei Mongol Abag Qi Hot",null,null,null,null,null,null,null,null,null,null,null,null,null,null,null,null,null,null,null,"Hissar",null,null,null,"Foggia",null,null,"Nyeri",null,null,null,null,null,null,null,null,null,null,null,null,null,null,null,null,null,null,null,null,null,null,"Leba",null,null,null,null,null,null,null,null,null,null,"Las Palmas",null,null,null,null,null,null,null,null,null,null,"CO_Denver-Stapleton"]
["AUS","QLD Amberley",496,1098,null,null,null,null,null,null,null,null,null,"QLD Cairns Aero",null,null,null,null,null,null,null,"Sao Paulo-Congonhas",null,null,"NB_Miramichi",null,"Ningxia Hui Guyuan",null,null,null,null,null,null,null,null,null,null,null,null,null,null,null,null,null,null,null,"Hyderabad",null,null,null,"Gela",null,null,"Voi",null,null,null,null,null,null,null,null,null,null,null,null,null,null,null,null,null,null,null,null,null,null,"Lebork",null,null,null,null,null,null,null,null,null,null,"Leon",null,null,null,null,null,null,null,null,null,null,"CT_Bridgeport"]
["AUS","QLD Brisbane",329,1061,null,null,null,null,null,null,null,null,null,"QLD Charleville Aero",null,null,null,null,null,null,null,null,null,null,"NB_Saint John",null,"Qinghai Daqaidam",null,null,null,null,null,null,null,null,null,null,null,null,null,null,null,null,null,null,null,"Imphal",null,null,null,"Genova",null,null,null,null,null,null,null,null,null,null,null,null,null,null,null,null,null,null,null,null,null,null,null,null,null,"Legnica",null,null,null,null,null,null,null,null,null,null,"Lerida",null,null,null,null,null,null,null,null,null,null,"CT_Hartford"]
["AUS","QLD Cairns Aero",0,2379,null,null,null,null,null,null,null,null,null,"QLD Gladstone Airport",null,null,null,null,null,null,null,null,null,null,"NF_Battle Harbour",null,"Shaanxi Ankang",null,null,null,null,null,null,null,null,null,null,null,null,null,null,null,null,null,null,null,"Indore",null,null,null,"Genova-Sestri",null,null,null,null,null,null,null,null,null,null,null,null,null,null,null,null,null,null,null,null,null,null,null,null,null,"Lesko",null,null,null,null,null,null,null,null,null,null,"Logrono",null,null,null,null,null,null,null,null,null,null,"CT_New Haven-Tweed AP"]
["AUS","QLD Charleville Aero",622,1627,null,null,null,null,null,null,null,null,null,"QLD Longreach Aero",null,null,null,null,null,null,null,null,null,null,"NF_Gander",null,"Shandong Longkou",null,null,null,null,null,null,null,null,null,null,null,null,null,null,null,null,null,null,null,"Jabalpur",null,null,null,"Gioia del Colle",null,null,null,null,null,null,null,null,null,null,null,null,null,null,null,null,null,null,null,null,null,null,null,null,null,"Leszno",null,null,null,null,null,null,null,null,null,null,"Lugo",null,null,null,null,null,null,null,null,null,null,"DE_Dover AFB"]
["AUS","QLD Gladstone Airport",78,1579,null,null,null,null,null,null,null,null,null,"QLD Mackay",null,null,null,null,null,null,null,null,null,null,"NF_Goose",null,"Shanxi Houma",null,null,null,null,null,null,null,null,null,null,null,null,null,null,null,null,null,null,null,"Jagdelpur",null,null,null,"Grosseto",null,null,null,null,null,null,null,null,null,null,null,null,null,null,null,null,null,null,null,null,null,null,null,null,null,"Lodz",null,null,null,null,null,null,null,null,null,null,"Madrid",null,null,null,null,null,null,null,null,null,null,"DE_Wilmington"]
["AUS","QLD Longreach Aero",210,2358,null,null,null,null,null,null,null,null,null,"QLD Mount Isa Aero",null,null,null,null,null,null,null,null,null,null,"NF_St Johns",null,"Sichuan Barkam",null,null,null,null,null,null,null,null,null,null,null,null,null,null,null,null,null,null,null,"Jaipur",null,null,null,"Lecce",null,null,null,null,null,null,null,null,null,null,null,null,null,null,null,null,null,null,null,null,null,null,null,null,null,"Lublin Radawiec",null,null,null,null,null,null,null,null,null,null,"Malaga",null,null,null,null,null,null,null,null,null,null,"FL_Daytona Beach"]
["AUS","QLD Mackay",63,1812,null,null,null,null,null,null,null,null,null,"QLD Oakey Aero",null,null,null,null,null,null,null,null,null,null,"NF_Stephenville",null,"Tianjin Tianjin",null,null,null,null,null,null,null,null,null,null,null,null,null,null,null,null,null,null,null,"Jaisalmer",null,null,null,"Marina di Ravenna",null,null,null,null,null,null,null,null,null,null,null,null,null,null,null,null,null,null,null,null,null,null,null,null,null,"Mikolajki",null,null,null,null,null,null,null,null,null,null,"Melilla",null,null,null,null,null,null,null,null,null,null,"FL_Fort Lauderdale Intl AP"]
["AUS","QLD Mount Isa Aero",121,2510,null,null,null,null,null,null,null,null,null,"QLD Rockhampton Aero",null,null,null,null,null,null,null,null,null,null,"NS_Greenwood",null,"Tibet Lhasa",null,null,null,null,null,null,null,null,null,null,null,null,null,null,null,null,null,null,null,"Jamnagar",null,null,null,"Messina",null,null,null,null,null,null,null,null,null,null,null,null,null,null,null,null,null,null,null,null,null,null,null,null,null,"Mlawa",null,null,null,null,null,null,null,null,null,null,"Murcia",null,null,null,null,null,null,null,null,null,null,"FL_Gainesville Rgnl AP"]
["AUS","QLD Oakey Aero",808,795,null,null,null,null,null,null,null,null,null,"QLD Townsville Aero",null,null,null,null,null,null,null,null,null,null,"NS_Sable Island",null,"Xinjiang Urgur Urumqi",null,null,null,null,null,null,null,null,null,null,null,null,null,null,null,null,null,null,null,"Jodhpur",null,null,null,"Milan",null,null,null,null,null,null,null,null,null,null,null,null,null,null,null,null,null,null,null,null,null,null,null,null,null,"Nowy Sacz",null,null,null,null,null,null,null,null,null,null,"Orense",null,null,null,null,null,null,null,null,null,null,"FL_Jacksonville"]
["AUS","QLD Rockhampton Aero",135,1620,null,null,null,null,null,null,null,null,null,"QLD Weipa Aero",null,null,null,null,null,null,null,null,null,null,"NS_Shearwater",null,"Yunnan Deqen",null,null,null,null,null,null,null,null,null,null,null,null,null,null,null,null,null,null,null,"Jorhat",null,null,null,"Milano-Linate",null,null,null,null,null,null,null,null,null,null,null,null,null,null,null,null,null,null,null,null,null,null,null,null,null,"Olsztyn",null,null,null,null,null,null,null,null,null,null,"Oviedo",null,null,null,null,null,null,null,null,null,null,"FL_Key West"]
["AUS","QLD Townsville Aero",27,2239,null,null,null,null,null,null,null,null,null,"QLD Willis Island",null,null,null,null,null,null,null,null,null,null,"NS_Sydney",null,"Zhejiang Dinghai",null,null,null,null,null,null,null,null,null,null,null,null,null,null,null,null,null,null,null,"Kolkata",null,null,null,"Milano-Malpensa",null,null,null,null,null,null,null,null,null,null,null,null,null,null,null,null,null,null,null,null,null,null,null,null,null,"Opole",null,null,null,null,null,null,null,null,null,null,"Palencia",null,null,null,null,null,null,null,null,null,null,"FL_Miami"]
["AUS","QLD Weipa Aero",0,3039,null,null,null,null,null,null,null,null,null,"SA Adelaide",null,null,null,null,null,null,null,null,null,null,"NS_Truro",null,null,null,null,null,null,null,null,null,null,null,null,null,null,null,null,null,null,null,null,null,"Kota",null,null,null,"Monte Cimone",null,null,null,null,null,null,null,null,null,null,null,null,null,null,null,null,null,null,null,null,null,null,null,null,null,"Ostroleka",null,null,null,null,null,null,null,null,null,null,"Palma",null,null,null,null,null,null,null,null,null,null,"FL_Orlando Intl AP"]
["AUS","QLD Willis Island",0,2961,null,null,null,null,null,null,null,null,null,"SA Adelaide-Kent Town",null,null,null,null,null,null,null,null,null,null,"NT_Inuvik",null,null,null,null,null,null,null,null,null,null,null,null,null,null,null,null,null,null,null,null,null,"Kurnool",null,null,null,"Monte Terminillo",null,null,null,null,null,null,null,null,null,null,null,null,null,null,null,null,null,null,null,null,null,null,null,null,null,"Pila",null,null,null,null,null,null,null,null,null,null,"Pamplona",null,null,null,null,null,null,null,null,null,null,"FL_Pensacola Rgnl AP"]
["AUS","SA Adelaide-Kent Town",1056,692,null,null,null,null,null,null,null,null,null,"SA Ceduna",null,null,null,null,null,null,null,null,null,null,"NT_Yellowknife",null,null,null,null,null,null,null,null,null,null,null,null,null,null,null,null,null,null,null,null,null,"Lucknow",null,null,null,"Naples",null,null,null,null,null,null,null,null,null,null,null,null,null,null,null,null,null,null,null,null,null,null,null,null,null,"Poznan",null,null,null,null,null,null,null,null,null,null,"Pontevedra",null,null,null,null,null,null,null,null,null,null,"FL_Tallahassee"]
["AUS","SA Adelaide",1122,479,null,null,null,null,null,null,null,null,null,"SA Mount Gambier Aero",null,null,null,null,null,null,null,null,null,null,"NU_Resolute",null,null,null,null,null,null,null,null,null,null,null,null,null,null,null,null,null,null,null,null,null,"Mangalore",null,null,null,"Napoli-Capodichino",null,null,null,null,null,null,null,null,null,null,null,null,null,null,null,null,null,null,null,null,null,null,null,null,null,"Przemysl",null,null,null,null,null,null,null,null,null,null,"Salamanca",null,null,null,null,null,null,null,null,null,null,"FL_West Palm Beach"]
["AUS","SA Ceduna",985,503,null,null,null,null,null,null,null,null,null,"SA Mt Lofty",null,null,null,null,null,null,null,null,null,null,"ON_Kingston",null,null,null,null,null,null,null,null,null,null,null,null,null,null,null,null,null,null,null,null,null,"Mumbai",null,null,null,"Novara-Cameri",null,null,null,null,null,null,null,null,null,null,null,null,null,null,null,null,null,null,null,null,null,null,null,null,null,"Raciborz",null,null,null,null,null,null,null,null,null,null,"San Sebastian",null,null,null,null,null,null,null,null,null,null,"GA_Athens"]
["AUS","SA Mount Gambier Aero",1935,120,null,null,null,null,null,null,null,null,null,"SA Oodnadatta Airport",null,null,null,null,null,null,null,null,null,null,"ON_London",null,null,null,null,null,null,null,null,null,null,null,null,null,null,null,null,null,null,null,null,null,"Nagpur",null,null,null,"Olbia-Costa Smeralda",null,null,null,null,null,null,null,null,null,null,null,null,null,null,null,null,null,null,null,null,null,null,null,null,null,"Resko",null,null,null,null,null,null,null,null,null,null,"Santander",null,null,null,null,null,null,null,null,null,null,"GA_Atlanta"]
["AUS","SA Mt Lofty",2604,162,null,null,null,null,null,null,null,null,null,"SA Woomera Aerodrome",null,null,null,null,null,null,null,null,null,null,"ON_Mount Forest",null,null,null,null,null,null,null,null,null,null,null,null,null,null,null,null,null,null,null,null,null,"Nellore",null,null,null,"Paganella",null,null,null,null,null,null,null,null,null,null,null,null,null,null,null,null,null,null,null,null,null,null,null,null,null,"Rzeszow Jasionka",null,null,null,null,null,null,null,null,null,null,"Segovia",null,null,null,null,null,null,null,null,null,null,"GA_Augusta"]
["AUS","SA Oodnadatta Airport",531,1964,null,null,null,null,null,null,null,null,null,"TAS Hobart-Ellerslie Road",null,null,null,null,null,null,null,null,null,null,"ON_Muskoka",null,null,null,null,null,null,null,null,null,null,null,null,null,null,null,null,null,null,null,null,null,"New Delhi",null,null,null,"Palermo",null,null,null,null,null,null,null,null,null,null,null,null,null,null,null,null,null,null,null,null,null,null,null,null,null,"Sandomierz",null,null,null,null,null,null,null,null,null,null,"Sevilla",null,null,null,null,null,null,null,null,null,null,"GA_Columbus"]
["AUS","SA Woomera Aerodrome",795,1245,null,null,null,null,null,null,null,null,null,"TAS Launceston Airport",null,null,null,null,null,null,null,null,null,null,"ON_North Bay",null,null,null,null,null,null,null,null,null,null,null,null,null,null,null,null,null,null,null,null,null,"Panjim",null,null,null,"Palermo-Boccadifalco",null,null,null,null,null,null,null,null,null,null,null,null,null,null,null,null,null,null,null,null,null,null,null,null,null,"Siedlce",null,null,null,null,null,null,null,null,null,null,"Soria",null,null,null,null,null,null,null,null,null,null,"GA_Macon"]
["AUS","TAS Hobart-Ellerslie Road",2073,52,null,null,null,null,null,null,null,null,null,"TAS Launceston-Ti Tree Bend",null,null,null,null,null,null,null,null,null,null,"ON_Ottawa",null,null,null,null,null,null,null,null,null,null,null,null,null,null,null,null,null,null,null,null,null,"Patna",null,null,null,"Palermo-Punta Raisi",null,null,null,null,null,null,null,null,null,null,null,null,null,null,null,null,null,null,null,null,null,null,null,null,null,"Slubice",null,null,null,null,null,null,null,null,null,null,"Tarragona",null,null,null,null,null,null,null,null,null,null,"GA_Savannah"]
["AUS","TAS Launceston-Ti Tree Bend",2105,68,null,null,null,null,null,null,null,null,null,"TAS Low Head",null,null,null,null,null,null,null,null,null,null,"ON_Sault Ste Marie",null,null,null,null,null,null,null,null,null,null,null,null,null,null,null,null,null,null,null,null,null,"Pune",null,null,null,"Parma",null,null,null,null,null,null,null,null,null,null,null,null,null,null,null,null,null,null,null,null,null,null,null,null,null,"Sniezka",null,null,null,null,null,null,null,null,null,null,"Tenerife",null,null,null,null,null,null,null,null,null,null,"HI_Hilo Intl AP"]
["AUS","TAS Launceston Airport",2460,29,null,null,null,null,null,null,null,null,null,"VIC Ballarat Aerodrome",null,null,null,null,null,null,null,null,null,null,"ON_Simcoe",null,null,null,null,null,null,null,null,null,null,null,null,null,null,null,null,null,null,null,null,null,"Raipur",null,null,null,"Patelleria",null,null,null,null,null,null,null,null,null,null,null,null,null,null,null,null,null,null,null,null,null,null,null,null,null,"Sulejow",null,null,null,null,null,null,null,null,null,null,"Teruel",null,null,null,null,null,null,null,null,null,null,"HI_Honolulu"]
["AUS","TAS Low Head",1679,40,null,null,null,null,null,null,null,null,null,"VIC Cape Otway Lighthouse",null,null,null,null,null,null,null,null,null,null,"ON_Thunder Bay",null,null,null,null,null,null,null,null,null,null,null,null,null,null,null,null,null,null,null,null,null,"Rajkot",null,null,null,"Perugia",null,null,null,null,null,null,null,null,null,null,null,null,null,null,null,null,null,null,null,null,null,null,null,null,null,"Suwalki",null,null,null,null,null,null,null,null,null,null,"Toledo",null,null,null,null,null,null,null,null,null,null,"IA_Burlington Muni AP"]
["AUS","VIC Ballarat Aerodrome",2220,184,null,null,null,null,null,null,null,null,null,"VIC East Sale Airport",null,null,null,null,null,null,null,null,null,null,"ON_Toronto",null,null,null,null,null,null,null,null,null,null,null,null,null,null,null,null,null,null,null,null,null,"Ramagundam",null,null,null,"Pescara",null,null,null,null,null,null,null,null,null,null,null,null,null,null,null,null,null,null,null,null,null,null,null,null,null,"Swinoujscie",null,null,null,null,null,null,null,null,null,null,"Valencia",null,null,null,null,null,null,null,null,null,null,"IA_Cedar Rapids Muni AP"]
["AUS","VIC Cape Otway Lighthouse",1625,152,null,null,null,null,null,null,null,null,null,"VIC Melbourne",null,null,null,null,null,null,null,null,null,null,"ON_Trenton",null,null,null,null,null,null,null,null,null,null,null,null,null,null,null,null,null,null,null,null,null,"Ranchi",null,null,null,"Piacenza",null,null,null,null,null,null,null,null,null,null,null,null,null,null,null,null,null,null,null,null,null,null,null,null,null,"Szczecin",null,null,null,null,null,null,null,null,null,null,"Valladolid",null,null,null,null,null,null,null,null,null,null,"IA_Des Moines"]
["AUS","VIC East Sale Airport",1832,133,null,null,null,null,null,null,null,null,null,"VIC Mildura Airport",null,null,null,null,null,null,null,null,null,null,"ON_Windsor",null,null,null,null,null,null,null,null,null,null,null,null,null,null,null,null,null,null,null,null,null,"Ratnagiri",null,null,null,"Pianosa",null,null,null,null,null,null,null,null,null,null,null,null,null,null,null,null,null,null,null,null,null,null,null,null,null,"Szczecinek",null,null,null,null,null,null,null,null,null,null,"Vitoria",null,null,null,null,null,null,null,null,null,null,"IA_Knoxville Muni AP"]
["AUS","VIC Melbourne",1733,210,null,null,null,null,null,null,null,null,null,"VIC Moorabbin Airport",null,null,null,null,null,null,null,null,null,null,"PE_Charlottetown",null,null,null,null,null,null,null,null,null,null,null,null,null,null,null,null,null,null,null,null,null,"Raxaul",null,null,null,"Pisa",null,null,null,null,null,null,null,null,null,null,null,null,null,null,null,null,null,null,null,null,null,null,null,null,null,"Tarnow",null,null,null,null,null,null,null,null,null,null,"Zamora",null,null,null,null,null,null,null,null,null,null,"IA_Sioux City"]
["AUS","VIC Mildura Airport",1160,769,null,null,null,null,null,null,null,null,null,"VIC Tullamarine-Melbourne Airport",null,null,null,null,null,null,null,null,null,null,"PQ_Bagotville",null,null,null,null,null,null,null,null,null,null,null,null,null,null,null,null,null,null,null,null,null,"Saharanpur",null,null,null,"Pisa-S Gusto",null,null,null,null,null,null,null,null,null,null,null,null,null,null,null,null,null,null,null,null,null,null,null,null,null,"Terespol",null,null,null,null,null,null,null,null,null,null,"Zaragoza",null,null,null,null,null,null,null,null,null,null,"IA_Waterloo"]
["AUS","VIC Moorabbin Airport",1650,195,null,null,null,null,null,null,null,null,null,"VIC Warrnambool Airport",null,null,null,null,null,null,null,null,null,null,"PQ_Baie Comeau",null,null,null,null,null,null,null,null,null,null,null,null,null,null,null,null,null,null,null,null,null,"Shillong",null,null,null,"Ponza",null,null,null,null,null,null,null,null,null,null,null,null,null,null,null,null,null,null,null,null,null,null,null,null,null,"Torun",null,null,null,null,null,null,null,null,null,null,null,null,null,null,null,null,null,null,null,null,null,"ID_Boise"]
["AUS","VIC Tullamarine-Melbourne Airport",1749,237,null,null,null,null,null,null,null,null,null,"WA Albany Airport",null,null,null,null,null,null,null,null,null,null,"PQ_Grindstone Island",null,null,null,null,null,null,null,null,null,null,null,null,null,null,null,null,null,null,null,null,null,"Sholapur",null,null,null,"Potenza",null,null,null,null,null,null,null,null,null,null,null,null,null,null,null,null,null,null,null,null,null,null,null,null,null,"Ustka",null,null,null,null,null,null,null,null,null,null,null,null,null,null,null,null,null,null,null,null,null,"ID_Idaho Falls-Fanning Field"]
["AUS","VIC Warrnambool Airport",1974,110,null,null,null,null,null,null,null,null,null,"WA Broome Airport",null,null,null,null,null,null,null,null,null,null,"PQ_Kuujjuarapik",null,null,null,null,null,null,null,null,null,null,null,null,null,null,null,null,null,null,null,null,null,"Sundernagar",null,null,null,"Pratica di Mare",null,null,null,null,null,null,null,null,null,null,null,null,null,null,null,null,null,null,null,null,null,null,null,null,null,"Warsaw",null,null,null,null,null,null,null,null,null,null,null,null,null,null,null,null,null,null,null,null,null,"IL_Chicago-OHare"]
["AUS","WA Albany Airport",1337,126,null,null,null,null,null,null,null,null,null,"WA Carnarvon Airport",null,null,null,null,null,null,null,null,null,null,"PQ_Kuujuaq",null,null,null,null,null,null,null,null,null,null,null,null,null,null,null,null,null,null,null,null,null,"Surat",null,null,null,"Rimini",null,null,null,null,null,null,null,null,null,null,null,null,null,null,null,null,null,null,null,null,null,null,null,null,null,"Warszawa Okecie",null,null,null,null,null,null,null,null,null,null,null,null,null,null,null,null,null,null,null,null,null,"IL_Springfield"]
["AUS","WA Broome Airport",4,3047,null,null,null,null,null,null,null,null,null,"WA Esperance",null,null,null,null,null,null,null,null,null,null,"PQ_La Grande Riviere",null,null,null,null,null,null,null,null,null,null,null,null,null,null,null,null,null,null,null,null,null,"Tezpur",null,null,null,"Roma-Ciampino",null,null,null,null,null,null,null,null,null,null,null,null,null,null,null,null,null,null,null,null,null,null,null,null,null,"Wielun",null,null,null,null,null,null,null,null,null,null,null,null,null,null,null,null,null,null,null,null,null,"IL_University of Illinois-Willard AP"]
["AUS","WA Carnarvon Airport",154,1445,null,null,null,null,null,null,null,null,null,"WA Forrest",null,null,null,null,null,null,null,null,null,null,"PQ_Lake Eon",null,null,null,null,null,null,null,null,null,null,null,null,null,null,null,null,null,null,null,null,null,"Tiruchirapalli",null,null,null,"Roma-Fiumicino",null,null,null,null,null,null,null,null,null,null,null,null,null,null,null,null,null,null,null,null,null,null,null,null,null,"Wlodawa",null,null,null,null,null,null,null,null,null,null,null,null,null,null,null,null,null,null,null,null,null,"IN_Evansville"]
["AUS","WA Esperance",958,279,null,null,null,null,null,null,null,null,null,"WA Geraldton Airport",null,null,null,null,null,null,null,null,null,null,"PQ_Mont Joli",null,null,null,null,null,null,null,null,null,null,null,null,null,null,null,null,null,null,null,null,null,"Trivandram",null,null,null,"Rome",null,null,null,null,null,null,null,null,null,null,null,null,null,null,null,null,null,null,null,null,null,null,null,null,null,"Wroclaw",null,null,null,null,null,null,null,null,null,null,null,null,null,null,null,null,null,null,null,null,null,"IN_Indianapolis"]
["AUS","WA Forrest",914,744,null,null,null,null,null,null,null,null,null,"WA Giles",null,null,null,null,null,null,null,null,null,null,"PQ_Montreal Intl AP",null,null,null,null,null,null,null,null,null,null,null,null,null,null,null,null,null,null,null,null,null,"Trivandrum",null,null,null,"S Maria di Leuca",null,null,null,null,null,null,null,null,null,null,null,null,null,null,null,null,null,null,null,null,null,null,null,null,null,"Zakopane",null,null,null,null,null,null,null,null,null,null,null,null,null,null,null,null,null,null,null,null,null,"KS_Topeka"]
["AUS","WA Geraldton Airport",503,932,null,null,null,null,null,null,null,null,null,"WA Halls Creek Airport",null,null,null,null,null,null,null,null,null,null,"PQ_Montreal Jean Brebeuf",null,null,null,null,null,null,null,null,null,null,null,null,null,null,null,null,null,null,null,null,null,"Veraval",null,null,null,"San Remo",null,null,null,null,null,null,null,null,null,null,null,null,null,null,null,null,null,null,null,null,null,null,null,null,null,"Zamosc",null,null,null,null,null,null,null,null,null,null,null,null,null,null,null,null,null,null,null,null,null,"KS_Wichita"]
["AUS","WA Giles",459,2216,null,null,null,null,null,null,null,null,null,"WA Kalamunda-Bickley",null,null,null,null,null,null,null,null,null,null,"PQ_Montreal Mirabel",null,null,null,null,null,null,null,null,null,null,null,null,null,null,null,null,null,null,null,null,null,"Vishakhapatnam",null,null,null,"Taranto",null,null,null,null,null,null,null,null,null,null,null,null,null,null,null,null,null,null,null,null,null,null,null,null,null,"Zielona Gora",null,null,null,null,null,null,null,null,null,null,null,null,null,null,null,null,null,null,null,null,null,"KY_Lexington"]
["AUS","WA Halls Creek Airport",33,3105,null,null,null,null,null,null,null,null,null,"WA Kalgoorlie-Boulder Airport",null,null,null,null,null,null,null,null,null,null,"PQ_Nitchequon CA",null,null,null,null,null,null,null,null,null,null,null,null,null,null,null,null,null,null,null,null,null,"",null,null,null,"Tarvisio",null,null,null,null,null,null,null,null,null,null,null,null,null,null,null,null,null,null,null,null,null,null,null,null,null,"",null,null,null,null,null,null,null,null,null,null,null,null,null,null,null,null,null,null,null,null,null,"KY_Louisville"]
["AUS","WA Kalamunda-Bickley",1171,468,null,null,null,null,null,null,null,null,null,"WA Katanning",null,null,null,null,null,null,null,null,null,null,"PQ_Quebec",null,null,null,null,null,null,null,null,null,null,null,null,null,null,null,null,null,null,null,null,null,"",null,null,null,"Torino",null,null,null,null,null,null,null,null,null,null,null,null,null,null,null,null,null,null,null,null,null,null,null,null,null,"",null,null,null,null,null,null,null,null,null,null,null,null,null,null,null,null,null,null,null,null,null,"LA_Lafayette RgnlAP"]
["AUS","WA Kalgoorlie-Boulder Airport",886,980,null,null,null,null,null,null,null,null,null,"WA Learmonth",null,null,null,null,null,null,null,null,null,null,"PQ_Riviere du Loup",null,null,null,null,null,null,null,null,null,null,null,null,null,null,null,null,null,null,null,null,null,"",null,null,null,"Torino-Caselle",null,null,null,null,null,null,null,null,null,null,null,null,null,null,null,null,null,null,null,null,null,null,null,null,null,"",null,null,null,null,null,null,null,null,null,null,null,null,null,null,null,null,null,null,null,null,null,"LA_New Orleans"]
["AUS","WA Katanning",1291,378,null,null,null,null,null,null,null,null,null,"WA Learmonth Airport",null,null,null,null,null,null,null,null,null,null,"PQ_Roberval",null,null,null,null,null,null,null,null,null,null,null,null,null,null,null,null,null,null,null,null,null,"",null,null,null,"Trapani-Birgi",null,null,null,null,null,null,null,null,null,null,null,null,null,null,null,null,null,null,null,null,null,null,null,null,null,"",null,null,null,null,null,null,null,null,null,null,null,null,null,null,null,null,null,null,null,null,null,"MA_Boston-Logan Intl AP"]
["AUS","WA Learmonth",64,2269,null,null,null,null,null,null,null,null,null,"WA Mandurah",null,null,null,null,null,null,null,null,null,null,"PQ_Schefferville",null,null,null,null,null,null,null,null,null,null,null,null,null,null,null,null,null,null,null,null,null,"",null,null,null,"Treviso-Istrana",null,null,null,null,null,null,null,null,null,null,null,null,null,null,null,null,null,null,null,null,null,null,null,null,null,"",null,null,null,null,null,null,null,null,null,null,null,null,null,null,null,null,null,null,null,null,null,"MA_Nantucket Mem AP"]
["AUS","WA Learmonth Airport",40,2185,null,null,null,null,null,null,null,null,null,"WA Manjimup",null,null,null,null,null,null,null,null,null,null,"PQ_Sept-Iles",null,null,null,null,null,null,null,null,null,null,null,null,null,null,null,null,null,null,null,null,null,"",null,null,null,"Trieste",null,null,null,null,null,null,null,null,null,null,null,null,null,null,null,null,null,null,null,null,null,null,null,null,null,"",null,null,null,null,null,null,null,null,null,null,null,null,null,null,null,null,null,null,null,null,null,"MD_Baltimore"]
["AUS","WA Mandurah",723,667,null,null,null,null,null,null,null,null,null,"WA Meekatharra Airport",null,null,null,null,null,null,null,null,null,null,"PQ_Sherbrooke",null,null,null,null,null,null,null,null,null,null,null,null,null,null,null,null,null,null,null,null,null,"",null,null,null,"Udine-Campoformido",null,null,null,null,null,null,null,null,null,null,null,null,null,null,null,null,null,null,null,null,null,null,null,null,null,"",null,null,null,null,null,null,null,null,null,null,null,null,null,null,null,null,null,null,null,null,null,"ME_Bangor Intl AP"]
["AUS","WA Manjimup",1501,193,null,null,null,null,null,null,null,null,null,"WA Newman Airport",null,null,null,null,null,null,null,null,null,null,"PQ_St Hubert",null,null,null,null,null,null,null,null,null,null,null,null,null,null,null,null,null,null,null,null,null,"",null,null,null,"Ustica",null,null,null,null,null,null,null,null,null,null,null,null,null,null,null,null,null,null,null,null,null,null,null,null,null,"",null,null,null,null,null,null,null,null,null,null,null,null,null,null,null,null,null,null,null,null,null,"ME_Portland"]
["AUS","WA Meekatharra Airport",426,1965,null,null,null,null,null,null,null,null,null,"WA Perth",null,null,null,null,null,null,null,null,null,null,"PQ_Ste Agathe des Monts",null,null,null,null,null,null,null,null,null,null,null,null,null,null,null,null,null,null,null,null,null,"",null,null,null,"Venezia-Tessera",null,null,null,null,null,null,null,null,null,null,null,null,null,null,null,null,null,null,null,null,null,null,null,null,null,"",null,null,null,null,null,null,null,null,null,null,null,null,null,null,null,null,null,null,null,null,null,"MI_Ann Arbor Muni AP"]
["AUS","WA Newman Airport",303,2539,null,null,null,null,null,null,null,null,null,"WA Perth Airport",null,null,null,null,null,null,null,null,null,null,"PQ_Val d Or",null,null,null,null,null,null,null,null,null,null,null,null,null,null,null,null,null,null,null,null,null,"",null,null,null,"Venice",null,null,null,null,null,null,null,null,null,null,null,null,null,null,null,null,null,null,null,null,null,null,null,null,null,"",null,null,null,null,null,null,null,null,null,null,null,null,null,null,null,null,null,null,null,null,null,"MI_Detroit-City AP"]
["AUS","WA Perth",747,757,null,null,null,null,null,null,null,null,null,"WA Port Hedland",null,null,null,null,null,null,null,null,null,null,"SK_Estevan",null,null,null,null,null,null,null,null,null,null,null,null,null,null,null,null,null,null,null,null,null,"",null,null,null,"Verona-Villafranca",null,null,null,null,null,null,null,null,null,null,null,null,null,null,null,null,null,null,null,null,null,null,null,null,null,"",null,null,null,null,null,null,null,null,null,null,null,null,null,null,null,null,null,null,null,null,null,"MN_Duluth"]
["AUS","WA Perth Airport",759,763,null,null,null,null,null,null,null,null,null,"WA Port Hedland Airport",null,null,null,null,null,null,null,null,null,null,"SK_North Battleford",null,null,null,null,null,null,null,null,null,null,null,null,null,null,null,null,null,null,null,null,null,"",null,null,null,"Vicenza",null,null,null,null,null,null,null,null,null,null,null,null,null,null,null,null,null,null,null,null,null,null,null,null,null,"",null,null,null,null,null,null,null,null,null,null,null,null,null,null,null,null,null,null,null,null,null,"MN_Minneapolis-St Paul"]
["AUS","WA Port Hedland",27,2789,null,null,null,null,null,null,null,null,null,"WA Wyndham",null,null,null,null,null,null,null,null,null,null,"SK_Regina",null,null,null,null,null,null,null,null,null,null,null,null,null,null,null,null,null,null,null,null,null,"",null,null,null,"",null,null,null,null,null,null,null,null,null,null,null,null,null,null,null,null,null,null,null,null,null,null,null,null,null,"",null,null,null,null,null,null,null,null,null,null,null,null,null,null,null,null,null,null,null,null,null,"MN_St Cloud Muni AP"]
["AUS","WA Port Hedland Airport",16,2764,null,null,null,null,null,null,null,null,null,null,null,null,null,null,null,null,null,null,null,null,"SK_Saskatoon",null,null,null,null,null,null,null,null,null,null,null,null,null,null,null,null,null,null,null,null,null,"",null,null,null,"",null,null,null,null,null,null,null,null,null,null,null,null,null,null,null,null,null,null,null,null,null,null,null,null,null,"",null,null,null,null,null,null,null,null,null,null,null,null,null,null,null,null,null,null,null,null,null,"MO_Kansas City"]
["AUS","WA Wyndham",0,4179,null,null,null,null,null,null,null,null,null,null,null,null,null,null,null,null,null,null,null,null,"SK_Swift Current",null,null,null,null,null,null,null,null,null,null,null,null,null,null,null,null,null,null,null,null,null,"",null,null,null,"",null,null,null,null,null,null,null,null,null,null,null,null,null,null,null,null,null,null,null,null,null,null,null,null,null,null,null,null,null,null,null,null,null,null,null,null,null,null,null,null,null,null,null,null,null,null,null,"MO_St Louis"]
["AUT","Graz",3260,150,null,null,null,null,null,null,null,null,null,null,null,null,null,null,null,null,null,null,null,null,"YT_Whitehorse",null,null,null,null,null,null,null,null,null,null,null,null,null,null,null,null,null,null,null,null,null,"",null,null,null,"",null,null,null,null,null,null,null,null,null,null,null,null,null,null,null,null,null,null,null,null,null,null,null,null,null,null,null,null,null,null,null,null,null,null,null,null,null,null,null,null,null,null,null,null,null,null,null,"MS_Columbus AFB"]
["AUT","Innsbruck",3395,112,null,null,null,null,null,null,null,null,null,null,null,null,null,null,null,null,null,null,null,null,null,null,null,null,null,null,null,null,null,null,null,null,null,null,null,null,null,null,null,null,null,null,"",null,null,null,"",null,null,null,null,null,null,null,null,null,null,null,null,null,null,null,null,null,null,null,null,null,null,null,null,null,null,null,null,null,null,null,null,null,null,null,null,null,null,null,null,null,null,null,null,null,null,null,"MS_Jackson"]
["AUT","Linz",3361,148,null,null,null,null,null,null,null,null,null,null,null,null,null,null,null,null,null,null,null,null,null,null,null,null,null,null,null,null,null,null,null,null,null,null,null,null,null,null,null,null,null,null,"",null,null,null,"",null,null,null,null,null,null,null,null,null,null,null,null,null,null,null,null,null,null,null,null,null,null,null,null,null,null,null,null,null,null,null,null,null,null,null,null,null,null,null,null,null,null,null,null,null,null,null,"MT_Bozeman-Gallatin Field"]
["AUT","Salzburg",3335,145,null,null,null,null,null,null,null,null,null,null,null,null,null,null,null,null,null,null,null,null,null,null,null,null,null,null,null,null,null,null,null,null,null,null,null,null,null,null,null,null,null,null,"",null,null,null,"",null,null,null,null,null,null,null,null,null,null,null,null,null,null,null,null,null,null,null,null,null,null,null,null,null,null,null,null,null,null,null,null,null,null,null,null,null,null,null,null,null,null,null,null,null,null,null,"NC_Asheville"]
["AUT","Vienna Schwechat",3158,223,null,null,null,null,null,null,null,null,null,null,null,null,null,null,null,null,null,null,null,null,null,null,null,null,null,null,null,null,null,null,null,null,null,null,null,null,null,null,null,null,null,null,"",null,null,null,"",null,null,null,null,null,null,null,null,null,null,null,null,null,null,null,null,null,null,null,null,null,null,null,null,null,null,null,null,null,null,null,null,null,null,null,null,null,null,null,null,null,null,null,null,null,null,null,"NC_Charlotte"]
["BEL","Brussels",2912,96,null,null,null,null,null,null,null,null,null,null,null,null,null,null,null,null,null,null,null,null,null,null,null,null,null,null,null,null,null,null,null,null,null,null,null,null,null,null,null,null,null,null,"",null,null,null,"",null,null,null,null,null,null,null,null,null,null,null,null,null,null,null,null,null,null,null,null,null,null,null,null,null,null,null,null,null,null,null,null,null,null,null,null,null,null,null,null,null,null,null,null,null,null,null,"NC_Greensboro"]
["BEL","Oostende",2846,21,null,null,null,null,null,null,null,null,null,null,null,null,null,null,null,null,null,null,null,null,null,null,null,null,null,null,null,null,null,null,null,null,null,null,null,null,null,null,null,null,null,null,"",null,null,null,"",null,null,null,null,null,null,null,null,null,null,null,null,null,null,null,null,null,null,null,null,null,null,null,null,null,null,null,null,null,null,null,null,null,null,null,null,null,null,null,null,null,null,null,null,null,null,null,"NC_Wilmington"]
["BEL","Saint Hubert",3853,13,null,null,null,null,null,null,null,null,null,null,null,null,null,null,null,null,null,null,null,null,null,null,null,null,null,null,null,null,null,null,null,null,null,null,null,null,null,null,null,null,null,null,"",null,null,null,"",null,null,null,null,null,null,null,null,null,null,null,null,null,null,null,null,null,null,null,null,null,null,null,null,null,null,null,null,null,null,null,null,null,null,null,null,null,null,null,null,null,null,null,null,null,null,null,"ND_Bismarck"]
["BGD","Bogra",35,2682,null,null,null,null,null,null,null,null,null,null,null,null,null,null,null,null,null,null,null,null,null,null,null,null,null,null,null,null,null,null,null,null,null,null,null,null,null,null,null,null,null,null,"",null,null,null,"",null,null,null,null,null,null,null,null,null,null,null,null,null,null,null,null,null,null,null,null,null,null,null,null,null,null,null,null,null,null,null,null,null,null,null,null,null,null,null,null,null,null,null,null,null,null,null,"ND_Fargo"]
["BGD","Chittagong-Patenga",0,2927,null,null,null,null,null,null,null,null,null,null,null,null,null,null,null,null,null,null,null,null,null,null,null,null,null,null,null,null,null,null,null,null,null,null,null,null,null,null,null,null,null,null,"",null,null,null,"",null,null,null,null,null,null,null,null,null,null,null,null,null,null,null,null,null,null,null,null,null,null,null,null,null,null,null,null,null,null,null,null,null,null,null,null,null,null,null,null,null,null,null,null,null,null,null,"NE_Kearney Muni AWOS"]
["BGD","Coxs Bazar",0,2930,null,null,null,null,null,null,null,null,null,null,null,null,null,null,null,null,null,null,null,null,null,null,null,null,null,null,null,null,null,null,null,null,null,null,null,null,null,null,null,null,null,null,"",null,null,null,"",null,null,null,null,null,null,null,null,null,null,null,null,null,null,null,null,null,null,null,null,null,null,null,null,null,null,null,null,null,null,null,null,null,null,null,null,null,null,null,null,null,null,null,null,null,null,null,"NE_Omaha"]
["BGD","Dhaka",10,2853,null,null,null,null,null,null,null,null,null,null,null,null,null,null,null,null,null,null,null,null,null,null,null,null,null,null,null,null,null,null,null,null,null,null,null,null,null,null,null,null,null,null,null,null,null,null,"",null,null,null,null,null,null,null,null,null,null,null,null,null,null,null,null,null,null,null,null,null,null,null,null,null,null,null,null,null,null,null,null,null,null,null,null,null,null,null,null,null,null,null,null,null,null,null,"NH_Concord"]
["BGD","Ishurdi",44,2612,null,null,null,null,null,null,null,null,null,null,null,null,null,null,null,null,null,null,null,null,null,null,null,null,null,null,null,null,null,null,null,null,null,null,null,null,null,null,null,null,null,null,null,null,null,null,"",null,null,null,null,null,null,null,null,null,null,null,null,null,null,null,null,null,null,null,null,null,null,null,null,null,null,null,null,null,null,null,null,null,null,null,null,null,null,null,null,null,null,null,null,null,null,null,"NJ_Atlantic City"]
["BGD","Jessore",22,2869,null,null,null,null,null,null,null,null,null,null,null,null,null,null,null,null,null,null,null,null,null,null,null,null,null,null,null,null,null,null,null,null,null,null,null,null,null,null,null,null,null,null,null,null,null,null,"",null,null,null,null,null,null,null,null,null,null,null,null,null,null,null,null,null,null,null,null,null,null,null,null,null,null,null,null,null,null,null,null,null,null,null,null,null,null,null,null,null,null,null,null,null,null,null,"NJ_Newark"]
["BGD","Rangpur",71,2410,null,null,null,null,null,null,null,null,null,null,null,null,null,null,null,null,null,null,null,null,null,null,null,null,null,null,null,null,null,null,null,null,null,null,null,null,null,null,null,null,null,null,null,null,null,null,null,null,null,null,null,null,null,null,null,null,null,null,null,null,null,null,null,null,null,null,null,null,null,null,null,null,null,null,null,null,null,null,null,null,null,null,null,null,null,null,null,null,null,null,null,null,null,null,"NM_Albuquerque"]
["BGD","Sylhet",16,2386,null,null,null,null,null,null,null,null,null,null,null,null,null,null,null,null,null,null,null,null,null,null,null,null,null,null,null,null,null,null,null,null,null,null,null,null,null,null,null,null,null,null,null,null,null,null,null,null,null,null,null,null,null,null,null,null,null,null,null,null,null,null,null,null,null,null,null,null,null,null,null,null,null,null,null,null,null,null,null,null,null,null,null,null,null,null,null,null,null,null,null,null,null,null,"NM_Los Alamos"]
["BGR","Plovdiv",2471,543,null,null,null,null,null,null,null,null,null,null,null,null,null,null,null,null,null,null,null,null,null,null,null,null,null,null,null,null,null,null,null,null,null,null,null,null,null,null,null,null,null,null,null,null,null,null,null,null,null,null,null,null,null,null,null,null,null,null,null,null,null,null,null,null,null,null,null,null,null,null,null,null,null,null,null,null,null,null,null,null,null,null,null,null,null,null,null,null,null,null,null,null,null,null,"NV_Las Vegas"]
["BGR","Sofia",3073,240,null,null,null,null,null,null,null,null,null,null,null,null,null,null,null,null,null,null,null,null,null,null,null,null,null,null,null,null,null,null,null,null,null,null,null,null,null,null,null,null,null,null,null,null,null,null,null,null,null,null,null,null,null,null,null,null,null,null,null,null,null,null,null,null,null,null,null,null,null,null,null,null,null,null,null,null,null,null,null,null,null,null,null,null,null,null,null,null,null,null,null,null,null,null,"NV_Reno"]
["BGR","Varna",2518,375,null,null,null,null,null,null,null,null,null,null,null,null,null,null,null,null,null,null,null,null,null,null,null,null,null,null,null,null,null,null,null,null,null,null,null,null,null,null,null,null,null,null,null,null,null,null,null,null,null,null,null,null,null,null,null,null,null,null,null,null,null,null,null,null,null,null,null,null,null,null,null,null,null,null,null,null,null,null,null,null,null,null,null,null,null,null,null,null,null,null,null,null,null,null,"NY_Albany"]
["BIH","Banja Luka",2898,265,null,null,null,null,null,null,null,null,null,null,null,null,null,null,null,null,null,null,null,null,null,null,null,null,null,null,null,null,null,null,null,null,null,null,null,null,null,null,null,null,null,null,null,null,null,null,null,null,null,null,null,null,null,null,null,null,null,null,null,null,null,null,null,null,null,null,null,null,null,null,null,null,null,null,null,null,null,null,null,null,null,null,null,null,null,null,null,null,null,null,null,null,null,null,"NY_Buffalo"]
["BLR","Minsk",4329,70,null,null,null,null,null,null,null,null,null,null,null,null,null,null,null,null,null,null,null,null,null,null,null,null,null,null,null,null,null,null,null,null,null,null,null,null,null,null,null,null,null,null,null,null,null,null,null,null,null,null,null,null,null,null,null,null,null,null,null,null,null,null,null,null,null,null,null,null,null,null,null,null,null,null,null,null,null,null,null,null,null,null,null,null,null,null,null,null,null,null,null,null,null,null,"NY_New York City-Central Park"]
["BLZ","Belize",0,3055,null,null,null,null,null,null,null,null,null,null,null,null,null,null,null,null,null,null,null,null,null,null,null,null,null,null,null,null,null,null,null,null,null,null,null,null,null,null,null,null,null,null,null,null,null,null,null,null,null,null,null,null,null,null,null,null,null,null,null,null,null,null,null,null,null,null,null,null,null,null,null,null,null,null,null,null,null,null,null,null,null,null,null,null,null,null,null,null,null,null,null,null,null,null,"NY_Niagara Falls Intl AP"]
["BOL","La Paz",4015,0,null,null,null,null,null,null,null,null,null,null,null,null,null,null,null,null,null,null,null,null,null,null,null,null,null,null,null,null,null,null,null,null,null,null,null,null,null,null,null,null,null,null,null,null,null,null,null,null,null,null,null,null,null,null,null,null,null,null,null,null,null,null,null,null,null,null,null,null,null,null,null,null,null,null,null,null,null,null,null,null,null,null,null,null,null,null,null,null,null,null,null,null,null,null,"NY_Syracuse"]
["BRA","Belem-Val de Caes",0,3090,null,null,null,null,null,null,null,null,null,null,null,null,null,null,null,null,null,null,null,null,null,null,null,null,null,null,null,null,null,null,null,null,null,null,null,null,null,null,null,null,null,null,null,null,null,null,null,null,null,null,null,null,null,null,null,null,null,null,null,null,null,null,null,null,null,null,null,null,null,null,null,null,null,null,null,null,null,null,null,null,null,null,null,null,null,null,null,null,null,null,null,null,null,null,"OH_Akron"]
["BRA","Belem",0,3115,null,null,null,null,null,null,null,null,null,null,null,null,null,null,null,null,null,null,null,null,null,null,null,null,null,null,null,null,null,null,null,null,null,null,null,null,null,null,null,null,null,null,null,null,null,null,null,null,null,null,null,null,null,null,null,null,null,null,null,null,null,null,null,null,null,null,null,null,null,null,null,null,null,null,null,null,null,null,null,null,null,null,null,null,null,null,null,null,null,null,null,null,null,null,"OH_Cleveland"]
["BRA","Belo Horizonte-Pampulha",21,1487,null,null,null,null,null,null,null,null,null,null,null,null,null,null,null,null,null,null,null,null,null,null,null,null,null,null,null,null,null,null,null,null,null,null,null,null,null,null,null,null,null,null,null,null,null,null,null,null,null,null,null,null,null,null,null,null,null,null,null,null,null,null,null,null,null,null,null,null,null,null,null,null,null,null,null,null,null,null,null,null,null,null,null,null,null,null,null,null,null,null,null,null,null,null,"OH_Toledo"]
["BRA","Boa Vista",0,3839,null,null,null,null,null,null,null,null,null,null,null,null,null,null,null,null,null,null,null,null,null,null,null,null,null,null,null,null,null,null,null,null,null,null,null,null,null,null,null,null,null,null,null,null,null,null,null,null,null,null,null,null,null,null,null,null,null,null,null,null,null,null,null,null,null,null,null,null,null,null,null,null,null,null,null,null,null,null,null,null,null,null,null,null,null,null,null,null,null,null,null,null,null,null,"OK_Oklahoma City"]
["BRA","Bom Jesus da Lapa",9,2963,null,null,null,null,null,null,null,null,null,null,null,null,null,null,null,null,null,null,null,null,null,null,null,null,null,null,null,null,null,null,null,null,null,null,null,null,null,null,null,null,null,null,null,null,null,null,null,null,null,null,null,null,null,null,null,null,null,null,null,null,null,null,null,null,null,null,null,null,null,null,null,null,null,null,null,null,null,null,null,null,null,null,null,null,null,null,null,null,null,null,null,null,null,null,"OK_Tulsa"]
["BRA","Brasilia",8,1295,null,null,null,null,null,null,null,null,null,null,null,null,null,null,null,null,null,null,null,null,null,null,null,null,null,null,null,null,null,null,null,null,null,null,null,null,null,null,null,null,null,null,null,null,null,null,null,null,null,null,null,null,null,null,null,null,null,null,null,null,null,null,null,null,null,null,null,null,null,null,null,null,null,null,null,null,null,null,null,null,null,null,null,null,null,null,null,null,null,null,null,null,null,null,"OR_Portland"]
["BRA","Campo Grande",32,2236,null,null,null,null,null,null,null,null,null,null,null,null,null,null,null,null,null,null,null,null,null,null,null,null,null,null,null,null,null,null,null,null,null,null,null,null,null,null,null,null,null,null,null,null,null,null,null,null,null,null,null,null,null,null,null,null,null,null,null,null,null,null,null,null,null,null,null,null,null,null,null,null,null,null,null,null,null,null,null,null,null,null,null,null,null,null,null,null,null,null,null,null,null,null,"OR_Redmond"]
["BRA","Cuiaba-Marechal Ron",20,3206,null,null,null,null,null,null,null,null,null,null,null,null,null,null,null,null,null,null,null,null,null,null,null,null,null,null,null,null,null,null,null,null,null,null,null,null,null,null,null,null,null,null,null,null,null,null,null,null,null,null,null,null,null,null,null,null,null,null,null,null,null,null,null,null,null,null,null,null,null,null,null,null,null,null,null,null,null,null,null,null,null,null,null,null,null,null,null,null,null,null,null,null,null,null,"PA_Allentown"]
["BRA","Curitiba-Afonso Pen",730,427,null,null,null,null,null,null,null,null,null,null,null,null,null,null,null,null,null,null,null,null,null,null,null,null,null,null,null,null,null,null,null,null,null,null,null,null,null,null,null,null,null,null,null,null,null,null,null,null,null,null,null,null,null,null,null,null,null,null,null,null,null,null,null,null,null,null,null,null,null,null,null,null,null,null,null,null,null,null,null,null,null,null,null,null,null,null,null,null,null,null,null,null,null,null,"PA_Harrisburg"]
["BRA","Florianopolis",201,1196,null,null,null,null,null,null,null,null,null,null,null,null,null,null,null,null,null,null,null,null,null,null,null,null,null,null,null,null,null,null,null,null,null,null,null,null,null,null,null,null,null,null,null,null,null,null,null,null,null,null,null,null,null,null,null,null,null,null,null,null,null,null,null,null,null,null,null,null,null,null,null,null,null,null,null,null,null,null,null,null,null,null,null,null,null,null,null,null,null,null,null,null,null,null,"PA_Lancaster AP"]
["BRA","Fortaleza-Pinto Mar",0,3371,null,null,null,null,null,null,null,null,null,null,null,null,null,null,null,null,null,null,null,null,null,null,null,null,null,null,null,null,null,null,null,null,null,null,null,null,null,null,null,null,null,null,null,null,null,null,null,null,null,null,null,null,null,null,null,null,null,null,null,null,null,null,null,null,null,null,null,null,null,null,null,null,null,null,null,null,null,null,null,null,null,null,null,null,null,null,null,null,null,null,null,null,null,null,"PA_Philadelphia"]
["BRA","Jacareacanga",0,2890,null,null,null,null,null,null,null,null,null,null,null,null,null,null,null,null,null,null,null,null,null,null,null,null,null,null,null,null,null,null,null,null,null,null,null,null,null,null,null,null,null,null,null,null,null,null,null,null,null,null,null,null,null,null,null,null,null,null,null,null,null,null,null,null,null,null,null,null,null,null,null,null,null,null,null,null,null,null,null,null,null,null,null,null,null,null,null,null,null,null,null,null,null,null,"RI_Pawtucket AWOS"]
["BRA","Manaus",0,3213,null,null,null,null,null,null,null,null,null,null,null,null,null,null,null,null,null,null,null,null,null,null,null,null,null,null,null,null,null,null,null,null,null,null,null,null,null,null,null,null,null,null,null,null,null,null,null,null,null,null,null,null,null,null,null,null,null,null,null,null,null,null,null,null,null,null,null,null,null,null,null,null,null,null,null,null,null,null,null,null,null,null,null,null,null,null,null,null,null,null,null,null,null,null,"RI_Providence"]
["BRA","Petrolina",0,3202,null,null,null,null,null,null,null,null,null,null,null,null,null,null,null,null,null,null,null,null,null,null,null,null,null,null,null,null,null,null,null,null,null,null,null,null,null,null,null,null,null,null,null,null,null,null,null,null,null,null,null,null,null,null,null,null,null,null,null,null,null,null,null,null,null,null,null,null,null,null,null,null,null,null,null,null,null,null,null,null,null,null,null,null,null,null,null,null,null,null,null,null,null,null,"SC_Charleston"]
["BRA","Porto Nacional",0,3304,null,null,null,null,null,null,null,null,null,null,null,null,null,null,null,null,null,null,null,null,null,null,null,null,null,null,null,null,null,null,null,null,null,null,null,null,null,null,null,null,null,null,null,null,null,null,null,null,null,null,null,null,null,null,null,null,null,null,null,null,null,null,null,null,null,null,null,null,null,null,null,null,null,null,null,null,null,null,null,null,null,null,null,null,null,null,null,null,null,null,null,null,null,null,"SC_Columbia"]
["BRA","Porto Velho",0,3035,null,null,null,null,null,null,null,null,null,null,null,null,null,null,null,null,null,null,null,null,null,null,null,null,null,null,null,null,null,null,null,null,null,null,null,null,null,null,null,null,null,null,null,null,null,null,null,null,null,null,null,null,null,null,null,null,null,null,null,null,null,null,null,null,null,null,null,null,null,null,null,null,null,null,null,null,null,null,null,null,null,null,null,null,null,null,null,null,null,null,null,null,null,null,"SC_Myrtle Beach AFB"]
["BRA","Recife-Guararapes",0,3338,null,null,null,null,null,null,null,null,null,null,null,null,null,null,null,null,null,null,null,null,null,null,null,null,null,null,null,null,null,null,null,null,null,null,null,null,null,null,null,null,null,null,null,null,null,null,null,null,null,null,null,null,null,null,null,null,null,null,null,null,null,null,null,null,null,null,null,null,null,null,null,null,null,null,null,null,null,null,null,null,null,null,null,null,null,null,null,null,null,null,null,null,null,null,"SD_Brookings AWOS"]
["BRA","Recife",0,3478,null,null,null,null,null,null,null,null,null,null,null,null,null,null,null,null,null,null,null,null,null,null,null,null,null,null,null,null,null,null,null,null,null,null,null,null,null,null,null,null,null,null,null,null,null,null,null,null,null,null,null,null,null,null,null,null,null,null,null,null,null,null,null,null,null,null,null,null,null,null,null,null,null,null,null,null,null,null,null,null,null,null,null,null,null,null,null,null,null,null,null,null,null,null,"SD_Huron"]
["BRA","Rio de Janeiro-Santos Dumont",4,2184,null,null,null,null,null,null,null,null,null,null,null,null,null,null,null,null,null,null,null,null,null,null,null,null,null,null,null,null,null,null,null,null,null,null,null,null,null,null,null,null,null,null,null,null,null,null,null,null,null,null,null,null,null,null,null,null,null,null,null,null,null,null,null,null,null,null,null,null,null,null,null,null,null,null,null,null,null,null,null,null,null,null,null,null,null,null,null,null,null,null,null,null,null,null,"SD_Sioux Falls"]
["BRA","Salvador",0,2901,null,null,null,null,null,null,null,null,null,null,null,null,null,null,null,null,null,null,null,null,null,null,null,null,null,null,null,null,null,null,null,null,null,null,null,null,null,null,null,null,null,null,null,null,null,null,null,null,null,null,null,null,null,null,null,null,null,null,null,null,null,null,null,null,null,null,null,null,null,null,null,null,null,null,null,null,null,null,null,null,null,null,null,null,null,null,null,null,null,null,null,null,null,null,"TN_Chattanooga"]
["BRA","Santa Maria",579,1144,null,null,null,null,null,null,null,null,null,null,null,null,null,null,null,null,null,null,null,null,null,null,null,null,null,null,null,null,null,null,null,null,null,null,null,null,null,null,null,null,null,null,null,null,null,null,null,null,null,null,null,null,null,null,null,null,null,null,null,null,null,null,null,null,null,null,null,null,null,null,null,null,null,null,null,null,null,null,null,null,null,null,null,null,null,null,null,null,null,null,null,null,null,null,"TN_Knoxville"]
["BRA","Sao Paulo-Congonhas",293,854,null,null,null,null,null,null,null,null,null,null,null,null,null,null,null,null,null,null,null,null,null,null,null,null,null,null,null,null,null,null,null,null,null,null,null,null,null,null,null,null,null,null,null,null,null,null,null,null,null,null,null,null,null,null,null,null,null,null,null,null,null,null,null,null,null,null,null,null,null,null,null,null,null,null,null,null,null,null,null,null,null,null,null,null,null,null,null,null,null,null,null,null,null,null,"TN_Memphis"]
["BRA","Sao Paulo",252,939,null,null,null,null,null,null,null,null,null,null,null,null,null,null,null,null,null,null,null,null,null,null,null,null,null,null,null,null,null,null,null,null,null,null,null,null,null,null,null,null,null,null,null,null,null,null,null,null,null,null,null,null,null,null,null,null,null,null,null,null,null,null,null,null,null,null,null,null,null,null,null,null,null,null,null,null,null,null,null,null,null,null,null,null,null,null,null,null,null,null,null,null,null,null,"TN_Nashville"]
["BRN","Bandar Seri Begawan",0,3340,null,null,null,null,null,null,null,null,null,null,null,null,null,null,null,null,null,null,null,null,null,null,null,null,null,null,null,null,null,null,null,null,null,null,null,null,null,null,null,null,null,null,null,null,null,null,null,null,null,null,null,null,null,null,null,null,null,null,null,null,null,null,null,null,null,null,null,null,null,null,null,null,null,null,null,null,null,null,null,null,null,null,null,null,null,null,null,null,null,null,null,null,null,null,"TX_Austin"]
["CAN","AB_Edmonton",5583,22,null,null,null,null,null,null,null,null,null,null,null,null,null,null,null,null,null,null,null,null,null,null,null,null,null,null,null,null,null,null,null,null,null,null,null,null,null,null,null,null,null,null,null,null,null,null,null,null,null,null,null,null,null,null,null,null,null,null,null,null,null,null,null,null,null,null,null,null,null,null,null,null,null,null,null,null,null,null,null,null,null,null,null,null,null,null,null,null,null,null,null,null,null,null,"TX_Dallas-Fort Worth Intl AP"]
["CAN","AB_Fort McMurray",6190,65,null,null,null,null,null,null,null,null,null,null,null,null,null,null,null,null,null,null,null,null,null,null,null,null,null,null,null,null,null,null,null,null,null,null,null,null,null,null,null,null,null,null,null,null,null,null,null,null,null,null,null,null,null,null,null,null,null,null,null,null,null,null,null,null,null,null,null,null,null,null,null,null,null,null,null,null,null,null,null,null,null,null,null,null,null,null,null,null,null,null,null,null,null,null,"TX_Houston-Intercontinental"]
["CAN","AB_Grande Prairie",5897,25,null,null,null,null,null,null,null,null,null,null,null,null,null,null,null,null,null,null,null,null,null,null,null,null,null,null,null,null,null,null,null,null,null,null,null,null,null,null,null,null,null,null,null,null,null,null,null,null,null,null,null,null,null,null,null,null,null,null,null,null,null,null,null,null,null,null,null,null,null,null,null,null,null,null,null,null,null,null,null,null,null,null,null,null,null,null,null,null,null,null,null,null,null,null,"UT_Salt Lake City"]
["CAN","AB_Lethbridge",4430,127,null,null,null,null,null,null,null,null,null,null,null,null,null,null,null,null,null,null,null,null,null,null,null,null,null,null,null,null,null,null,null,null,null,null,null,null,null,null,null,null,null,null,null,null,null,null,null,null,null,null,null,null,null,null,null,null,null,null,null,null,null,null,null,null,null,null,null,null,null,null,null,null,null,null,null,null,null,null,null,null,null,null,null,null,null,null,null,null,null,null,null,null,null,null,"VA_Lynchburg"]
["CAN","AB_Medicine Hat",4677,198,null,null,null,null,null,null,null,null,null,null,null,null,null,null,null,null,null,null,null,null,null,null,null,null,null,null,null,null,null,null,null,null,null,null,null,null,null,null,null,null,null,null,null,null,null,null,null,null,null,null,null,null,null,null,null,null,null,null,null,null,null,null,null,null,null,null,null,null,null,null,null,null,null,null,null,null,null,null,null,null,null,null,null,null,null,null,null,null,null,null,null,null,null,null,"VA_Norfolk"]
["CAN","BC_Abbotsford",3135,33,null,null,null,null,null,null,null,null,null,null,null,null,null,null,null,null,null,null,null,null,null,null,null,null,null,null,null,null,null,null,null,null,null,null,null,null,null,null,null,null,null,null,null,null,null,null,null,null,null,null,null,null,null,null,null,null,null,null,null,null,null,null,null,null,null,null,null,null,null,null,null,null,null,null,null,null,null,null,null,null,null,null,null,null,null,null,null,null,null,null,null,null,null,null,"VA_Richmond"]
["CAN","BC_Comox",3177,31,null,null,null,null,null,null,null,null,null,null,null,null,null,null,null,null,null,null,null,null,null,null,null,null,null,null,null,null,null,null,null,null,null,null,null,null,null,null,null,null,null,null,null,null,null,null,null,null,null,null,null,null,null,null,null,null,null,null,null,null,null,null,null,null,null,null,null,null,null,null,null,null,null,null,null,null,null,null,null,null,null,null,null,null,null,null,null,null,null,null,null,null,null,null,"VA_Roanoke"]
["CAN","BC_Fort St John",5862,26,null,null,null,null,null,null,null,null,null,null,null,null,null,null,null,null,null,null,null,null,null,null,null,null,null,null,null,null,null,null,null,null,null,null,null,null,null,null,null,null,null,null,null,null,null,null,null,null,null,null,null,null,null,null,null,null,null,null,null,null,null,null,null,null,null,null,null,null,null,null,null,null,null,null,null,null,null,null,null,null,null,null,null,null,null,null,null,null,null,null,null,null,null,null,"VT_Burlington"]
["CAN","BC_Kamloops",3630,286,null,null,null,null,null,null,null,null,null,null,null,null,null,null,null,null,null,null,null,null,null,null,null,null,null,null,null,null,null,null,null,null,null,null,null,null,null,null,null,null,null,null,null,null,null,null,null,null,null,null,null,null,null,null,null,null,null,null,null,null,null,null,null,null,null,null,null,null,null,null,null,null,null,null,null,null,null,null,null,null,null,null,null,null,null,null,null,null,null,null,null,null,null,null,"WA_Seattle-Tacoma"]
["CAN","BC_Port Hardy",3712,0,null,null,null,null,null,null,null,null,null,null,null,null,null,null,null,null,null,null,null,null,null,null,null,null,null,null,null,null,null,null,null,null,null,null,null,null,null,null,null,null,null,null,null,null,null,null,null,null,null,null,null,null,null,null,null,null,null,null,null,null,null,null,null,null,null,null,null,null,null,null,null,null,null,null,null,null,null,null,null,null,null,null,null,null,null,null,null,null,null,null,null,null,null,null,"WI_Green Bay"]
["CAN","BC_Prince George",5071,15,null,null,null,null,null,null,null,null,null,null,null,null,null,null,null,null,null,null,null,null,null,null,null,null,null,null,null,null,null,null,null,null,null,null,null,null,null,null,null,null,null,null,null,null,null,null,null,null,null,null,null,null,null,null,null,null,null,null,null,null,null,null,null,null,null,null,null,null,null,null,null,null,null,null,null,null,null,null,null,null,null,null,null,null,null,null,null,null,null,null,null,null,null,null,"WV_Charleston"]
["CAN","BC_Prince Rupert",4152,0,null,null,null,null,null,null,null,null,null,null,null,null,null,null,null,null,null,null,null,null,null,null,null,null,null,null,null,null,null,null,null,null,null,null,null,null,null,null,null,null,null,null,null,null,null,null,null,null,null,null,null,null,null,null,null,null,null,null,null,null,null,null,null,null,null,null,null,null,null,null,null,null,null,null,null,null,null,null,null,null,null,null,null,null,null,null,null,null,null,null,null,null,null,null,"WY_Cheyenne"]
["CAN","BC_Sandspit",3642,0,null,null,null,null,null,null,null,null,null,null,null,null,null,null,null,null,null,null,null,null,null,null,null,null,null,null,null,null,null,null,null,null,null,null,null,null,null,null,null,null,null,null,null,null,null,null,null,null,null,null,null,null,null,null,null,null,null,null,null,null,null,null,null,null,null,null,null,null,null,null,null,null,null,null,null,null,null,null,null,null,null,null,null,null,null,null,null,null,null,null,null,null,null,null,"WY_Rock Springs"]
["CAN","BC_Smithers",5266,21,null,null,null,null,null,null,"<-Last row"]
["CAN","BC_Summerland",3386,200,null,null,null,null,null,null,null,null,null,null,null,null,null,null,null,null,null,null,null,null,null,null,null,null,null,null,null,null,null,null,null,null,null,null,null,null,null,null,null,null,null,null,null,null,null,null,null,null,null,null,null,null,null,null,null,null,null,null,null,null,null,null,null,null,null,null,null,null,null,null,null,null,null,null,null,null,null,null,null,null,null,null,null,null,null,null,null,null,null,null,null,null,null,null,{"$f":"IFERROR(INDEX(wCity, MATCH(MIN(IF((COUNTIF(CU$5:CU141, wCity)=0)*(wCountry=CU$5), 1, MAX((COUNTIF(wCity, \"<\"&wCity)+1)*2))*(COUNTIF(wCity, \"<\"&wCity)+1)), IF(wCountry=CU$5,COUNTIF(wCity, \"<\"&wCity)+1,\"\"), 0)),\"\")","v":""}]
["CAN","BC_Vancouver",3020,5,null,null,null,null,null,null,null,null,null,null,null,null,null,null,null,null,null,null,null,null,null,null,null,null,null,null,null,null,null,null,null,null,null,null,null,null,null,null,null,null,null,null,null,null,null,null,null,null,null,null,null,null,null,null,null,null,null,null,null,null,null,null,null,null,null,null,null,null,null,null,null,null,null,null,null,null,null,null,null,null,null,null,null,null,null,null,null,null,null,null,null,null,null,null,{"$f":"IFERROR(INDEX(wCity, MATCH(MIN(IF((COUNTIF(CU$5:CU143, wCity)=0)*(wCountry=CU$5), 1, MAX((COUNTIF(wCity, \"<\"&wCity)+1)*2))*(COUNTIF(wCity, \"<\"&wCity)+1)), IF(wCountry=CU$5,COUNTIF(wCity, \"<\"&wCity)+1,\"\"), 0)),\"\")","v":""}]
["CAN","BC_Victoria",3076,8,null,null,null,null,null,null,null,null,null,null,null,null,null,null,null,null,null,null,null,null,null,null,null,null,null,null,null,null,null,null,null,null,null,null,null,null,null,null,null,null,null,null,null,null,null,null,null,null,null,null,null,null,null,null,null,null,null,null,null,null,null,null,null,null,null,null,null,null,null,null,null,null,null,null,null,null,null,null,null,null,null,null,null,null,null,null,null,null,null,null,null,null,null,null,{"$f":"IFERROR(INDEX(wCity, MATCH(MIN(IF((COUNTIF(CU$5:CU144, wCity)=0)*(wCountry=CU$5), 1, MAX((COUNTIF(wCity, \"<\"&wCity)+1)*2))*(COUNTIF(wCity, \"<\"&wCity)+1)), IF(wCountry=CU$5,COUNTIF(wCity, \"<\"&wCity)+1,\"\"), 0)),\"\")","v":""}]
["CAN","MB_Brandon",5911,95,null,null,null,null,null,null,null,null,null,null,null,null,null,null,null,null,null,null,null,null,null,null,null,null,null,null,null,null,null,null,null,null,null,null,null,null,null,null,null,null,null,null,null,null,null,null,null,null,null,null,null,null,null,null,null,null,null,null,null,null,null,null,null,null,null,null,null,null,null,null,null,null,null,null,null,null,null,null,null,null,null,null,null,null,null,null,null,null,null,null,null,null,null,null,{"$f":"IFERROR(INDEX(wCity, MATCH(MIN(IF((COUNTIF(CU$5:CU145, wCity)=0)*(wCountry=CU$5), 1, MAX((COUNTIF(wCity, \"<\"&wCity)+1)*2))*(COUNTIF(wCity, \"<\"&wCity)+1)), IF(wCountry=CU$5,COUNTIF(wCity, \"<\"&wCity)+1,\"\"), 0)),\"\")","v":""}]
["CAN","MB_Churchill",9115,3,null,null,null,null,null,null,null,null,null,null,null,null,null,null,null,null,null,null,null,null,null,null,null,null,null,null,null,null,null,null,null,null,null,null,null,null,null,null,null,null,null,null,null,null,null,null,null,null,null,null,null,null,null,null,null,null,null,null,null,null,null,null,null,null,null,null,null,null,null,null,null,null,null,null,null,null,null,null,null,null,null,null,null,null,null,null,null,null,null,null,null,null,null,null,{"$f":"IFERROR(INDEX(wCity, MATCH(MIN(IF((COUNTIF(CU$5:CU146, wCity)=0)*(wCountry=CU$5), 1, MAX((COUNTIF(wCity, \"<\"&wCity)+1)*2))*(COUNTIF(wCity, \"<\"&wCity)+1)), IF(wCountry=CU$5,COUNTIF(wCity, \"<\"&wCity)+1,\"\"), 0)),\"\")","v":""}]
["CAN","MB_The Pas",6443,105,null,null,null,null,null,null,null,null,null,null,null,null,null,null,null,null,null,null,null,null,null,null,null,null,null,null,null,null,null,null,null,null,null,null,null,null,null,null,null,null,null,null,null,null,null,null,null,null,null,null,null,null,null,null,null,null,null,null,null,null,null,null,null,null,null,null,null,null,null,null,null,null,null,null,null,null,null,null,null,null,null,null,null,null,null,null,null,null,null,null,null,null,null,null,{"$f":"IFERROR(INDEX(wCity, MATCH(MIN(IF((COUNTIF(CU$5:CU147, wCity)=0)*(wCountry=CU$5), 1, MAX((COUNTIF(wCity, \"<\"&wCity)+1)*2))*(COUNTIF(wCity, \"<\"&wCity)+1)), IF(wCountry=CU$5,COUNTIF(wCity, \"<\"&wCity)+1,\"\"), 0)),\"\")","v":""}]
["CAN","MB_Winnipeg",5754,197,null,null,null,null,null,null,null,null,null,null,null,null,null,null,null,null,null,null,null,null,null,null,null,null,null,null,null,null,null,null,null,null,null,null,null,null,null,null,null,null,null,null,null,null,null,null,null,null,null,null,null,null,null,null,null,null,null,null,null,null,null,null,null,null,null,null,null,null,null,null,null,null,null,null,null,null,null,null,null,null,null,null,null,null,null,null,null,null,null,null,null,null,null,null,{"$f":"IFERROR(INDEX(wCity, MATCH(MIN(IF((COUNTIF(CU$5:CU148, wCity)=0)*(wCountry=CU$5), 1, MAX((COUNTIF(wCity, \"<\"&wCity)+1)*2))*(COUNTIF(wCity, \"<\"&wCity)+1)), IF(wCountry=CU$5,COUNTIF(wCity, \"<\"&wCity)+1,\"\"), 0)),\"\")","v":""}]
["CAN","NB_Fredericton",4734,131,null,null,null,null,null,null,null,null,null,null,null,null,null,null,null,null,null,null,null,null,null,null,null,null,null,null,null,null,null,null,null,null,null,null,null,null,null,null,null,null,null,null,null,null,null,null,null,null,null,null,null,null,null,null,null,null,null,null,null,null,null,null,null,null,null,null,null,null,null,null,null,null,null,null,null,null,null,null,null,null,null,null,null,null,null,null,null,null,null,null,null,null,null,null,{"$f":"IFERROR(INDEX(wCity, MATCH(MIN(IF((COUNTIF(CU$5:CU149, wCity)=0)*(wCountry=CU$5), 1, MAX((COUNTIF(wCity, \"<\"&wCity)+1)*2))*(COUNTIF(wCity, \"<\"&wCity)+1)), IF(wCountry=CU$5,COUNTIF(wCity, \"<\"&wCity)+1,\"\"), 0)),\"\")","v":""}]
["CAN","NB_Miramichi",4920,141,null,null,null,null,null,null,null,null,null,null,null,null,null,null,null,null,null,null,null,null,null,null,null,null,null,null,null,null,null,null,null,null,null,null,null,null,null,null,null,null,null,null,null,null,null,null,null,null,null,null,null,null,null,null,null,null,null,null,null,null,null,null,null,null,null,null,null,null,null,null,null,null,null,null,null,null,null,null,null,null,null,null,null,null,null,null,null,null,null,null,null,null,null,null,{"$f":"IFERROR(INDEX(wCity, MATCH(MIN(IF((COUNTIF(CU$5:CU150, wCity)=0)*(wCountry=CU$5), 1, MAX((COUNTIF(wCity, \"<\"&wCity)+1)*2))*(COUNTIF(wCity, \"<\"&wCity)+1)), IF(wCountry=CU$5,COUNTIF(wCity, \"<\"&wCity)+1,\"\"), 0)),\"\")","v":""}]
["CAN","NB_Saint John",4695,11]
["CAN","NF_Battle Harbour",6463,0]
["CAN","NF_Gander",5099,25]
["CAN","NF_Goose",6558,38]
["CAN","NF_St Johns",4886,24]
["CAN","NF_Stephenville",4723,9]
["CAN","NS_Greenwood",4130,128]
["CAN","NS_Sable Island",3860,13]
["CAN","NS_Shearwater",4199,57]
["CAN","NS_Sydney",4634,52]
["CAN","NS_Truro",4536,36]
["CAN","NT_Inuvik",9951,17]
["CAN","NT_Yellowknife",8257,27]
["CAN","NU_Resolute",12571,0]
["CAN","ON_Kingston",4287,188]
["CAN","ON_London",4111,211]
["CAN","ON_Mount Forest",4580,121]
["CAN","ON_Muskoka",4773,97]
["CAN","ON_North Bay",5340,103]
["CAN","ON_Ottawa",4664,189]
["CAN","ON_Sault Ste Marie",4992,75]
["CAN","ON_Simcoe",4066,189]
["CAN","ON_Thunder Bay",5623,60]
["CAN","ON_Toronto",4089,232]
["CAN","ON_Trenton",4175,206]
["CAN","ON_Windsor",3569,367]
["CAN","PE_Charlottetown",4646,72]
["CAN","PQ_Bagotville",5780,50]
["CAN","PQ_Baie Comeau",5889,3]
["CAN","PQ_Grindstone Island",4940,18]
["CAN","PQ_Kuujjuarapik",7987,12]
["CAN","PQ_Kuujuaq",8491,1]
["CAN","PQ_La Grande Riviere",7616,10]
["CAN","PQ_Lake Eon",7384,8]
["CAN","PQ_Mont Joli",5521,65]
["CAN","PQ_Montreal Intl AP",4493,234]
["CAN","PQ_Montreal Jean Brebeuf",4615,209]
["CAN","PQ_Montreal Mirabel",4862,102]
["CAN","PQ_Nitchequon CA",7922,6]
["CAN","PQ_Quebec",4966,111]
["CAN","PQ_Riviere du Loup",5423,82]
["CAN","PQ_Roberval",5757,97]
["CAN","PQ_Schefferville",8056,7]
["CAN","PQ_Sept-Iles",6135,4]
["CAN","PQ_Sherbrooke",5067,93]
["CAN","PQ_St Hubert",4566,251]
["CAN","PQ_Ste Agathe des Monts",5351,44]
["CAN","PQ_Val d Or",6129,79]
["CAN","SK_Estevan",5368,190]
["CAN","SK_North Battleford",5961,75]
["CAN","SK_Regina",5646,130]
["CAN","SK_Saskatoon",5812,84]
["CAN","SK_Swift Current",5227,96]
["CAN","YT_Whitehorse",6946,2]
["CHE","Geneva",2965,193]
["CHL","Antofagasta",598,236]
["CHL","Concepcion",1843,5]
["CHL","Easter Island",76,1020]
["CHL","Punta Arenas",4273,0]
["CHL","Santiago",1570,268]
["CHN","Anhui Anqing",1671,1312]
["CHN","Beijing Beijing",2790,837]
["CHN","Chongqing Chongqing Shapingba",1103,1272]
["CHN","Fujian Congwu",648,1388]
["CHN","Gansu Dunhuang",3587,587]
["CHN","Guangdong Dianbai",143,2195]
["CHN","Guangdong Shenzhen",245,2034]
["CHN","Guangxi Zhuang Baise",400,1935]
["CHN","Guizhou Bijie",2190,345]
["CHN","Hainan Dongfang",34,2673]
["CHN","Hebei Fengning",4142,308]
["CHN","Heilongjiang Anda",5443,378]
["CHN","Henan Anyang",2340,1023]
["CHN","Hong Kong SAR",202,2064]
["CHN","Hubei Exi",1602,925]
["CHN","Hunan Changde",1586,1255]
["CHN","Jiangsu Dongtai",2092,922]
["CHN","Jiangxi Ganzhou",1050,1605]
["CHN","Jilin Baicheng",5154,370]
["CHN","Kinjiang Uygar Kashi",2920,788]
["CHN","Liaoning Chaoyang",3753,556]
["CHN","Nei Mongol Abag Qi Hot",6110,248]
["CHN","Ningxia Hui Guyuan",4236,125]
["CHN","Qinghai Daqaidam",5703,13]
["CHN","Shaanxi Ankang",1745,978]
["CHN","Shandong Longkou",2696,695]
["CHN","Shanxi Houma",2621,834]
["CHN","Sichuan Barkam",3442,13]
["CHN","Tianjin Tianjin",2735,867]
["CHN","Tibet Lhasa",3550,11]
["CHN","Xinjiang Urgur Urumqi",4390,524]
["CHN","Yunnan Deqen",4420,0]
["CHN","Zhejiang Dinghai",1454,1025]
["COL","Bogota",1755,0]
["CUB","Bahia Honda",3,2575]
["CUB","Camaguey",7,2463]
["CUB","Casa Blanca",0,2581]
["CUB","Cienfuegos",25,2456]
["CUB","Guantanamo Bay NAS",0,3167]
["CUB","Havana-Jose Marti",2,2435]
["CUB","Havana",10,2432]
["CUB","La Bajada",3,2621]
["CUB","La Fe",7,2584]
["CUB","Paso Real de San Diego",8,2369]
["CUB","Pinar del Rio",5,2412]
["CUB","Playa Giron",4,2371]
["CUB","Puerto Padre",1,2913]
["CUB","Punta de Maisi",0,3236]
["CUB","Sancti Spiritus",15,2333]
["CUB","Santiago de Cuba",0,2849]
["CUB","Saua la Grande",2,2388]
["CUB","Union de Reyes",9,2474]
["CUB","Varadero",1,2556]
["CYP","Larnaca",759,1259]
["CZE","Ostrava",3561,106]
["CZE","Prague",3703,84]
["DEU","Berlin",3156,170]
["DEU","Bremen",3428,92]
["DEU","Dusseldorf",2865,133]
["DEU","Frankfurt am Main",3044,148]
["DEU","Hamburg",3367,82]
["DEU","Koln",3029,80]
["DEU","Mannheim",2738,221]
["DEU","Munich",3738,79]
["DEU","Stuttgart",3338,93]
["DNK","Copenhagen",3563,29]
["DZA","Algiers",1019,903]
["ECU","Quito",1554,0]
["EGY","Al Minya",489,1902]
["EGY","Alexandria",416,1296]
["EGY","Aswan",221,3223]
["EGY","Asyut",457,2141]
["EGY","Cairo",390,1746]
["EGY","Cairo Intl Airport",307,1859]
["EGY","El Arish",455,1320]
["EGY","Helwan",411,1803]
["EGY","Hurghada",88,2723]
["EGY","Ismailia",422,1698]
["EGY","Kharga",279,2806]
["EGY","Luxor",252,2728]
["ESP","Albacete",2126,487]
["ESP","Alicante",856,809]
["ESP","Almeria",702,900]
["ESP","Avila",2898,121]
["ESP","Badajoz",1331,753]
["ESP","Barcelona",1419,588]
["ESP","Bilbao",1612,171]
["ESP","Burgos",2991,46]
["ESP","Caceres",1458,804]
["ESP","Castellon",1112,650]
["ESP","Ceuta",1071,375]
["ESP","Ciudad Real",1945,611]
["ESP","Cordoba",1121,936]
["ESP","Cuenca",2422,332]
["ESP","Gerona",1808,394]
["ESP","Granada",1716,577]
["ESP","Guadalajara",2036,423]
["ESP","Huelva",748,872]
["ESP","Huesca",2096,433]
["ESP","Jaen",1353,965]
["ESP","La Coruna",1488,79]
["ESP","Las Palmas",103,1013]
["ESP","Leon",2750,117]
["ESP","Lerida",1819,593]
["ESP","Logrono",2003,344]
["ESP","Lugo",2496,24]
["ESP","Madrid",1965,628]
["ESP","Malaga",797,792]
["ESP","Melilla",642,812]
["ESP","Murcia",1040,652]
["ESP","Orense",1685,339]
["ESP","Oviedo",2019,54]
["ESP","Palencia",2464,190]
["ESP","Palma",1215,741]
["ESP","Pamplona",2279,168]
["ESP","Pontevedra",1329,233]
["ESP","Salamanca",2499,187]
["ESP","San Sebastian",1909,89]
["ESP","Santander",1369,209]
["ESP","Segovia",2527,267]
["ESP","Sevilla",916,1063]
["ESP","Soria",2873,130]
["ESP","Tarragona",1095,808]
["ESP","Tenerife",56,1166]
["ESP","Teruel",2582,227]
["ESP","Toledo",1683,791]
["ESP","Valencia",1052,796]
["ESP","Valladolid",2377,268]
["ESP","Vitoria",2551,57]
["ESP","Zamora",2285,285]
["ESP","Zaragoza",1789,571]
["ETH","Addis Ababa-Bole",705,30]
["ETH","Awassa",32,594]
["ETH","Bahar Dar",23,778]
["ETH","Combolcha",95,695]
["ETH","Debre Marcos",780,65]
["ETH","Dire Dawa",0,2604]
["ETH","Gondar",60,759]
["ETH","Jimma",171,247]
["ETH","Metehara",0,2927]
["FIN","Helsinki",4712,33]
["FIN","Tampere",5020,22]
["FJI","Nadi",0,2637]
["FRA","Bordeaux",2008,263]
["FRA","Brest",2492,13]
["FRA","Clermont-Ferrand",2594,198]
["FRA","Dijon",2839,163]
["FRA","Lyon",2539,302]
["FRA","Marseille",1735,578]
["FRA","Montpellier",1693,531]
["FRA","Nancy",2978,117]
["FRA","Nantes",2254,152]
["FRA","Nice",1454,551]
["FRA","Paris Orly",2644,142]
["FRA","Strasbourg",2947,136]
["GBR","Aberdeen Dyce",3504,2]
["GBR","Aughton",3100,6]
["GBR","Belfast",3246,2]
["GBR","Birmingham",3055,21]
["GBR","Hemsby",2979,11]
["GBR","Jersey Channel Islands",2513,14]
["GBR","Leuchars",3414,3]
["GBR","London Gatwick",2866,32]
["GBR","Oban",3184,2]
["GHA","Accra",0,3241]
["GRC","Andravida",1212,737]
["GRC","Athens",1112,1076]
["GRC","Thessaloniki",1741,792]
["GTM","Flores",1,2502]
["GTM","Guatemala-La Aurora",112,370]
["GTM","Huehuetenango",480,114]
["GTM","Puerto Barrios",0,2770]
["GTM","San Jose",0,3104]
["GUM","Andersen AFB",0,3169]
["GUM","Anderson AFB",0,2904]
["GUM","Tamuning-Won Pat Intl AP",0,3335]
["HND","Amapala",0,3956]
["HND","Catacamas",0,2382]
["HND","Choluteca",0,3818]
["HND","La Ceiba-Goloson",0,2732]
["HND","La Mesa-San Pedro Sula",0,3000]
["HND","Puerto Lempira",0,3181]
["HND","Santa Rosa de Copan",104,827]
["HND","Tela",0,2860]
["HUN","Debrecen",3129,279]
["HUN","Szombathely",3132,226]
["IND","Ahmedabad",13,3382]
["IND","Akola",0,3442]
["IND","Allahabad",164,2892]
["IND","Amritsar",0,3442]
["IND","Aurangabad",8,2803]
["IND","Bangalore",0,2036]
["IND","Barmer",59,3547]
["IND","Belgaum",0,2110]
["IND","Bhagalpur",18,3085]
["IND","Bhopal",24,2677]
["IND","Bhubneshwar",0,3242]
["IND","Bikaner",252,3313]
["IND","Calcutta",18,3028]
["IND","Chennai-Madras",0,3718]
["IND","Chennai",0,3734]
["IND","Chirtadurg",0,2523]
["IND","Dehradun",520,1634]
["IND","Dibrugarh",216,1818]
["IND","Gorakhpur",172,2732]
["IND","Guwahati",71,2252]
["IND","Gwalior",233,2964]
["IND","Hissar",341,2751]
["IND","Hyderabad",0,3183]
["IND","Imphal",456,1270]
["IND","Indore",27,2490]
["IND","Jabalpur",78,2618]
["IND","Jagdelpur",22,2377]
["IND","Jaipur",170,2954]
["IND","Jaisalmer",136,3248]
["IND","Jamnagar",8,2768]
["IND","Jodhpur",115,3051]
["IND","Jorhat",174,2070]
["IND","Kolkata",11,3021]
["IND","Kota",78,3243]
["IND","Kurnool",0,3699]
["IND","Lucknow",203,2590]
["IND","Mangalore",0,3236]
["IND","Mumbai",0,3349]
["IND","Nagpur",8,3220]
["IND","Nellore",0,3899]
["IND","New Delhi",278,2721]
["IND","Panjim",0,3312]
["IND","Patna",130,2749]
["IND","Pune",10,2228]
["IND","Raipur",6,3144]
["IND","Rajkot",9,3227]
["IND","Ramagundam",0,3526]
["IND","Ranchi",107,2134]
["IND","Ratnagiri",0,3163]
["IND","Raxaul",196,2433]
["IND","Saharanpur",569,1950]
["IND","Shillong",1454,120]
["IND","Sholapur",0,3350]
["IND","Sundernagar",949,1198]
["IND","Surat",0,3349]
["IND","Tezpur",72,2146]
["IND","Tiruchirapalli",0,3996]
["IND","Trivandram",9,3227]
["IND","Trivandrum",0,3340]
["IND","Veraval",0,3142]
["IND","Vishakhapatnam",0,3468]
["IRL","Belmullet",2816,0]
["IRL","Birr",3055,3]
["IRL","Clones",3252,3]
["IRL","Dublin",2992,5]
["IRL","Kilkenny",3024,2]
["IRL","Valentia Observatory",2573,1]
["IRN","Bandar Abass",63,3258]
["IRN","Esfahan",1827,1189]
["IRN","Shiraz",1472,1430]
["IRN","Tabriz",2921,730]
["IRN","Tehran-Mehrabad",1749,1482]
["IRN","Yazd",1411,1835]
["ISL","Reykjavik",4917,0]
["ISR","Beer Sheva",763,1216]
["ISR","Eilat",207,2645]
["ISR","Jerusalem-Atarot AP",1364,639]
["ISR","Jerusalem",1364,647]
["ISR","Tel Aviv-Bet Dagan",709,1059]
["ITA","Alghero",1222,558]
["ITA","Ancona-Falconara",2062,378]
["ITA","Ancona",1787,540]
["ITA","Aviano",2599,335]
["ITA","Bari-Palese Macchie",1414,670]
["ITA","Bergamo-Orio al Serio",2550,324]
["ITA","Bologna-Borgo Panigale",2394,557]
["ITA","Bolzano",2913,254]
["ITA","Bonifati",1715,384]
["ITA","Brescia-Ghedi",2567,435]
["ITA","Brindisi",1210,716]
["ITA","Cagliari-Elmas",1207,630]
["ITA","Campobasso",2699,249]
["ITA","Capo Bellavista",1094,651]
["ITA","Capo Palinuro",1237,639]
["ITA","Catania-Fontanarossa",1099,778]
["ITA","Catania-Sigonella",1159,847]
["ITA","Cozzo Spadaro",838,874]
["ITA","Crotone",1353,728]
["ITA","Enna",2413,365]
["ITA","Firenze-Peretola",1901,528]
["ITA","Foggia",1668,703]
["ITA","Gela",928,578]
["ITA","Genova-Sestri",1529,521]
["ITA","Genova",1348,653]
["ITA","Gioia del Colle",2005,407]
["ITA","Grosseto",1692,537]
["ITA","Lecce",1294,630]
["ITA","Marina di Ravenna",2181,455]
["ITA","Messina",881,837]
["ITA","Milan",2639,380]
["ITA","Milano-Linate",2454,414]
["ITA","Milano-Malpensa",2781,281]
["ITA","Monte Cimone",5808,0]
["ITA","Monte Terminillo",4993,4]
["ITA","Naples",1364,756]
["ITA","Napoli-Capodichino",1446,539]
["ITA","Novara-Cameri",2768,275]
["ITA","Olbia-Costa Smeralda",1302,585]
["ITA","Paganella",6116,0]
["ITA","Palermo-Boccadifalco",873,888]
["ITA","Palermo-Punta Raisi",744,897]
["ITA","Palermo",724,1022]
["ITA","Parma",2542,391]
["ITA","Patelleria",1091,678]
["ITA","Perugia",2235,366]
["ITA","Pescara",1825,460]
["ITA","Piacenza",2609,372]
["ITA","Pianosa",1070,570]
["ITA","Pisa-S Gusto",1774,412]
["ITA","Pisa",1757,520]
["ITA","Ponza",1289,530]
["ITA","Potenza",2690,254]
["ITA","Pratica di Mare",1593,404]
["ITA","Rimini",2294,394]
["ITA","Roma-Ciampino",1558,575]
["ITA","Roma-Fiumicino",1514,508]
["ITA","Rome",1444,649]
["ITA","S Maria di Leuca",1199,766]
["ITA","San Remo",1456,464]
["ITA","Taranto",1317,801]
["ITA","Tarvisio",4035,25]
["ITA","Torino-Caselle",2842,287]
["ITA","Torino",2506,381]
["ITA","Trapani-Birgi",920,746]
["ITA","Treviso-Istrana",2518,401]
["ITA","Trieste",1882,594]
["ITA","Udine-Campoformido",2326,399]
["ITA","Ustica",1141,591]
["ITA","Venezia-Tessera",2265,493]
["ITA","Venice",2262,526]
["ITA","Verona-Villafranca",2475,412]
["ITA","Vicenza",2445,434]
["JPN","Kagoshima",1095,1225]
["JPN","Matsumoto",2790,509]
["JPN","Miho Civ JASDF",1934,719]
["JPN","Nagoya",1837,926]
["JPN","Osaka",1773,992]
["JPN","Sapporo",3578,236]
["JPN","Shimonoseki",1411,905]
["JPN","Tokyo Hyakuri",2311,508]
["JPN","Tosashimizu",1082,1082]
["KAZ","Semipalatinsk",5302,301]
["KEN","Eldoret",484,74]
["KEN","Embu",86,420]
["KEN","Garissa",0,3771]
["KEN","Kisii",21,575]
["KEN","Kisumu",0,1794]
["KEN","Kitale",175,244]
["KEN","Lamu-Manda Island",0,3322]
["KEN","Lodwar",0,4283]
["KEN","Makindu",3,1621]
["KEN","Malindi",0,3053]
["KEN","Mandera",0,4187]
["KEN","Marsabit",8,766]
["KEN","Meru",124,219]
["KEN","Mombasa-Moi",0,2882]
["KEN","Moyale",0,1588]
["KEN","Nairobi-Dagoretti",243,193]
["KEN","Nairobi-Kenyatta",122,405]
["KEN","Nairobi-Wilson",137,376]
["KEN","Nairobi",115,407]
["KEN","Nakuru",252,181]
["KEN","Narok",370,106]
["KEN","Nyeri",324,97]
["KEN","Voi",1,2351]
["KOR","Inchon",2782,560]
["KOR","Kangnung",2407,590]
["KOR","Kwangju",2255,788]
["KOR","Ulsan",2125,683]
["KWT","KISR Coastal Station",293,3198]
["KWT","Kuwait Intl AP",313,3407]
["LBY","Tripoli",700,1558]
["LKA","Anuradhapura",0,3438]
["LKA","Batticaloa",0,3651]
["LKA","Colombo-Katunayake",0,3417]
["LKA","Colombo-Ratmalana",0,3379]
["LKA","Hambantota",0,3293]
["LKA","Kankasanturai",0,3649]
["LKA","Nuwara Eliya",947,3]
["LKA","Puttalam",0,3424]
["LKA","Trincomalee",0,3648]
["LTU","Kaunas",4137,71]
["MAC","Macau",273,1993]
["MAR","Casablanca Nouasser",829,582]
["MDG","Antananarivo",383,510]
["MDV","Gan Island",0,3658]
["MDV","Male-Hulule Island",0,3708]
["MEX","Acapulco",0,3432]
["MEX","Mexico City",547,131]
["MEX","Veracruz",0,2562]
["MHL","Kwajalein Atoll",0,3484]
["MNG","Ulaanbataar",6752,77]
["MNG","Ulaangom",7498,86]
["MTQ","Fort-de-France",0,3031]
["MYS","George Town",0,3387]
["MYS","Kota Baharu",0,3284]
["MYS","Kuala Lumpur",0,3342]
["MYS","Kuching",0,2982]
["NIC","Chinandega",0,3350]
["NIC","Managua-Augusto CES",0,3153]
["NIC","Rivas",0,3115]
["NLD","Amsterdam",2971,61]
["NLD","Beek",2975,108]
["NLD","Groningen",3279,40]
["NOR","Bergen",3996,21]
["NOR","Oslo Fornebu",4171,33]
["NPL","Kathmandu",892,782]
["NPL","Surkhet",412,1892]
["NZL","Auckland-Auckland AK",1165,166]
["NZL","Auckland Auckland",1163,131]
["NZL","Bay of Plenty-Tauranga BP",1274,150]
["NZL","Canterbury-Christchurch CC",2490,49]
["NZL","Canterbury Christchurch",2441,58]
["NZL","Central Otago-Lauder OC",3164,31]
["NZL","East Coast-Napier EC",1604,146]
["NZL","Manawatu-Paraparaumu MW",1821,38]
["NZL","Nelson Marlborough-Nelson NM",1912,46]
["NZL","Northland-Kaitaia NL",1024,102]
["NZL","Otago-Dunedin DN",2657,7]
["NZL","Queenstown Lakes-Queenstown QL",3121,12]
["NZL","Rotorua-Rotorua RR",2146,17]
["NZL","Southland-Invercargill IN",2937,3]
["NZL","Taranaki-New Plymouth NP",1646,32]
["NZL","Taupo King Country-Turangi TP",2365,37]
["NZL","Waikato-Hamilton HN",1710,64]
["NZL","Wairarapa-Masterton WI",2100,66]
["NZL","Wellington-Wellington WN",1930,27]
["NZL","Wellington Wellington",1849,25]
["NZL","West Coast-Hokitika WC",2416,6]
["PAK","Karachi",41,3045]
["PER","Arequipa",1222,0]
["PER","Cuzco",2177,0]
["PER","Lima",114,735]
["PHL","Manila",0,3464]
["PLW","Koror Island",0,3322]
["POL","Bialystok",4101,55]
["POL","Bielsko Biala",3558,124]
["POL","Bydgoszcz",3742,69]
["POL","Chojnice",4006,47]
["POL","Czestochowa",3685,103]
["POL","Elblag",3949,44]
["POL","Gdansk Port Polnocny",3438,62]
["POL","Gorzow Wlkp",3445,145]
["POL","Hel",3571,42]
["POL","Jelenia Gora",3854,46]
["POL","Kalisz",3777,123]
["POL","Kasprowy Wierch",6808,0]
["POL","Katowice",3712,92]
["POL","Ketrzyn",3994,49]
["POL","Kielce",3887,78]
["POL","Klodzko",3782,57]
["POL","Kolo",3522,91]
["POL","Kolobrzeg",3538,30]
["POL","Koszalin",3687,40]
["POL","Krakow",3682,104]
["POL","Krosno",3710,108]
["POL","Leba",3734,47]
["POL","Lebork",3739,65]
["POL","Legnica",3383,111]
["POL","Lesko",3672,68]
["POL","Leszno",3800,81]
["POL","Lodz",3691,127]
["POL","Lublin Radawiec",3810,82]
["POL","Mikolajki",4019,72]
["POL","Mlawa",3921,58]
["POL","Nowy Sacz",3554,88]
["POL","Olsztyn",4106,72]
["POL","Opole",3418,108]
["POL","Ostroleka",3824,82]
["POL","Pila",3586,80]
["POL","Poznan",3522,100]
["POL","Przemysl",3862,98]
["POL","Raciborz",3468,77]
["POL","Resko",3532,68]
["POL","Rzeszow Jasionka",3894,87]
["POL","Sandomierz",3638,103]
["POL","Siedlce",3890,95]
["POL","Slubice",3378,86]
["POL","Sniezka",6003,0]
["POL","Sulejow",3767,81]
["POL","Suwalki",4299,54]
["POL","Swinoujscie",3353,53]
["POL","Szczecin",3411,61]
["POL","Szczecinek",3742,62]
["POL","Tarnow",3386,104]
["POL","Terespol",3820,104]
["POL","Torun",3665,76]
["POL","Ustka",3695,20]
["POL","Warsaw",3616,102]
["POL","Warszawa Okecie",3666,112]
["POL","Wielun",3593,122]
["POL","Wlodawa",3876,100]
["POL","Wroclaw",3671,93]
["POL","Zakopane",4574,7]
["POL","Zamosc",3989,76]
["POL","Zielona Gora",3639,96]
["PRI","Aguadilla-Borinquen AP",0,2737]
["PRI","Mayaguez-Eugenio Maria de Hostos AP",0,2710]
["PRI","Mercedita AP",0,2948]
["PRI","Roosevelt Roads NAS",0,3375]
["PRI","San Juan-Luis Munoz Marin Intl AP",0,3127]
["PRI","San Juan",0,2984]
["PRI","San Juan Intl AP",0,3128]
["PRK","Chongjin",3781,231]
["PRK","Haeju",2914,546]
["PRK","Pyongyang",3283,541]
["PRT","Braganca",2340,297]
["PRT","Coimbra",1294,325]
["PRT","Evora",1351,553]
["PRT","Faro",770,685]
["PRT","Funchal Madeira-Islands",642,287]
["PRT","Lajes",622,439]
["PRT","Lisboa",1087,474]
["PRT","Porto",1491,146]
["PRY","Asuncion",235,2026]
["ROU","Bucharest",3030,400]
["ROU","Cluj-Napoca",3596,132]
["ROU","Constanta",2608,411]
["ROU","Craiova",2848,465]
["ROU","Galati",2962,408]
["ROU","Timisoara",2896,365]
["RUS","Arkhangelsk",6019,45]
["RUS","Chita",6918,47]
["RUS","Ekaterinburg",5801,108]
["RUS","Irkutsk",6676,36]
["RUS","Moscow",4655,99]
["RUS","Omsk",6099,196]
["RUS","Saint-Petersburg",4654,58]
["RUS","Samara",4996,155]
["RUS","Yakutsk",10032,124]
["SAU","Riyadh",305,3301]
["SEN","Dakar",1,2231]
["SGP","Singapore",0,3454]
["SLV","Acajutla",0,3466]
["SLV","San Salvador-Ilopango",0,1964]
["SRB","Belgrade",2795,422]
["SRB","Podgorica",1811,770]
["SVK","Bratislava",3037,261]
["SVK","Kosice",3450,188]
["SVN","Ljubljana",3383,168]
["SWE","Goteborg Landvetter",4198,10]
["SWE","Karlstad",4426,17]
["SWE","Kiruna",6967,0]
["SWE","Ostersund Froson",5437,16]
["SWE","Stockholm Arlanda",4239,36]
["SYR","Damascus",1548,1007]
["THA","Bangkok",0,3837]
["TUN","Tunis",831,1124]
["TUR","Ankara",3307,253]
["TUR","Istanbul",1886,609]
["TUR","Izmir",1391,926]
["TWN","Taipei",226,1969]
["UKR","Kiev",3808,174]
["UKR","Odessa",3245,346]
["UMI","Wake Island",0,3032]
["URY","Montevideo",1231,431]
["USA","AK_Anchorage",5611,4]
["USA","AK_Fairbanks",7715,25]
["USA","AL_Birmingham",1492,950]
["USA","AL_Huntsville Intl AP-Jones Field",1846,948]
["USA","AL_Montgomery",1137,1176]
["USA","AR_Bentonville AWOS",2374,875]
["USA","AR_Fayetteville-Drake Field",1971,993]
["USA","AR_Little Rock",1730,1084]
["USA","AZ_Flagstaff",3985,81]
["USA","AZ_Grand Canyon National Park AP",3494,102]
["USA","AZ_Tucson",865,1615]
["USA","CA_Fresno",1435,1093]
["USA","CA_Long Beach",744,444]
["USA","CA_Los Angeles Intl AP",844,236]
["USA","CA_Monterey NAF",1808,26]
["USA","CA_Sacramento",1570,531]
["USA","CA_San Diego",573,420]
["USA","CA_San Francisco",1825,32]
["USA","CA_Santa Barbara Muni AP",1243,52]
["USA","CO_Boulder",3322,360]
["USA","CO_Colorado Springs",3568,272]
["USA","CO_Denver-Stapleton",3379,352]
["USA","CT_Bridgeport",3043,469]
["USA","CT_Hartford",3349,438]
["USA","CT_New Haven-Tweed AP",2936,399]
["USA","DE_Dover AFB",2664,579]
["USA","DE_Wilmington",2720,645]
["USA","FL_Daytona Beach",447,1576]
["USA","FL_Fort Lauderdale Intl AP",62,2530]
["USA","FL_Gainesville Rgnl AP",698,1458]
["USA","FL_Jacksonville",780,1448]
["USA","FL_Key West",28,2721]
["USA","FL_Miami",64,2369]
["USA","FL_Orlando Intl AP",282,1694]
["USA","FL_Pensacola Rgnl AP",624,1517]
["USA","FL_Tallahassee",937,1304]
["USA","FL_West Palm Beach",111,2162]
["USA","GA_Athens",1530,903]
["USA","GA_Atlanta",1674,896]
["USA","GA_Augusta",1590,970]
["USA","GA_Columbus",1271,1164]
["USA","GA_Macon",1288,1123]
["USA","GA_Savannah",1045,1254]
["USA","HI_Hilo Intl AP",0,1853]
["USA","HI_Honolulu",0,2399]
["USA","IA_Burlington Muni AP",3305,577]
["USA","IA_Cedar Rapids Muni AP",3722,440]
["USA","IA_Des Moines",3525,547]
["USA","IA_Knoxville Muni AP",3176,739]
["USA","IA_Sioux City",3664,512]
["USA","IA_Waterloo",3941,355]
["USA","ID_Boise",3268,443]
["USA","ID_Idaho Falls-Fanning Field",4219,184]
["USA","IL_Chicago-OHare",3474,464]
["USA","IL_Springfield",3177,685]
["USA","IL_University of Illinois-Willard AP",3107,591]
["USA","IN_Evansville",2557,758]
["USA","IN_Indianapolis",3077,531]
["USA","KS_Topeka",2885,754]
["USA","KS_Wichita",2686,909]
["USA","KY_Lexington",2674,578]
["USA","KY_Louisville",2384,761]
["USA","LA_Lafayette RgnlAP",850,1488]
["USA","LA_New Orleans",760,1459]
["USA","MA_Boston-Logan Intl AP",3160,401]
["USA","MA_Nantucket Mem AP",2824,187]
["USA","MD_Baltimore",2625,659]
["USA","ME_Bangor Intl AP",4332,139]
["USA","ME_Portland",3957,187]
["USA","MI_Ann Arbor Muni AP",3389,316]
["USA","MI_Detroit-City AP",3247,553]
["USA","MN_Duluth",5504,99]
["USA","MN_Minneapolis-St Paul",4298,394]
["USA","MN_St Cloud Muni AP",4849,281]
["USA","MO_Kansas City",2795,852]
["USA","MO_St Louis",2734,844]
["USA","MS_Columbus AFB",1829,1146]
["USA","MS_Jackson",1354,1205]
["USA","MT_Bozeman-Gallatin Field",4507,194]
["USA","NC_Asheville",2476,400]
["USA","NC_Charlotte",1821,861]
["USA","NC_Greensboro",2187,685]
["USA","NC_Wilmington",1422,1060]
["USA","ND_Bismarck",4719,252]
["USA","ND_Fargo",4905,334]
["USA","NE_Kearney Muni AWOS",3488,487]
["USA","NE_Omaha",3294,622]
["USA","NH_Concord",4050,254]
["USA","NJ_Atlantic City",2766,543]
["USA","NJ_Newark",2760,623]
["USA","NM_Albuquerque",2424,688]
["USA","NM_Los Alamos",3216,216]
["USA","NV_Las Vegas",1248,1806]
["USA","NV_Reno",3155,303]
["USA","NY_Albany",3772,334]
["USA","NY_Buffalo",3609,323]
["USA","NY_New York City-Central Park",2743,592]
["USA","NY_Niagara Falls Intl AP",3462,373]
["USA","NY_Syracuse",3762,303]
["USA","OH_Akron",3352,367]
["USA","OH_Cleveland",3255,394]
["USA","OH_Toledo",3618,387]
["USA","OK_Oklahoma City",2090,1037]
["USA","OK_Tulsa",2085,1085]
["USA","OR_Portland",2426,144]
["USA","OR_Redmond",3584,152]
["USA","PA_Allentown",3146,430]
["USA","PA_Harrisburg",2954,588]
["USA","PA_Lancaster AP",2641,543]
["USA","PA_Philadelphia",2787,602]
["USA","RI_Pawtucket AWOS",3474,296]
["USA","RI_Providence",3210,378]
["USA","SC_Charleston",1180,1089]
["USA","SC_Columbia",1496,1057]
["USA","SC_Myrtle Beach AFB",1262,1097]
["USA","SD_Brookings AWOS",4264,290]
["USA","SD_Huron",4473,334]
["USA","SD_Sioux Falls",4249,482]
["USA","TN_Chattanooga",1929,876]
["USA","TN_Knoxville",1985,749]
["USA","TN_Memphis",1643,1173]
["USA","TN_Nashville",2145,972]
["USA","TX_Austin",896,1647]
["USA","TX_Dallas-Fort Worth Intl AP",1265,1533]
["USA","TX_Houston-Intercontinental",826,1573]
["USA","UT_Salt Lake City",3095,631]
["USA","VA_Lynchburg",2392,613]
["USA","VA_Norfolk",1874,836]
["USA","VA_Richmond",2178,744]
["USA","VA_Roanoke",2260,595]
["USA","VT_Burlington",4197,258]
["USA","WA_Seattle-Tacoma",2668,68]
["USA","WI_Green Bay",4441,256]
["USA","WV_Charleston",2473,515]
["USA","WY_Cheyenne",3994,163]
["USA","WY_Rock Springs",4575,150]
["UZB","Tashkent",2302,1055]
["VEN","Caracas",0,3082]
["VIR","Charlotte Amalie-Harry S Truman AP",18,3327]
["VNM","Hanoi",168,2337]
["ZAF","Cape Town",868,326]
["ZAF","Johannesburg",1052,267]
["ZWE","Harare",365,699]
[]
[]
[]
[]
[]
[]
[]
[]
[]
[]
[]
[]
[]
[]
[]
[]
[]
[]
[]
[]
[]
[]
[]
[]
[]
[]
[]
[]
[]
[]
[]
[]
[]
[]
[]
[]
[]
[]
[]
[]
[]
[]
[]
[]
[]
[]
[]
[]
[]
[]
[]
[]
[]
[]
[]
[]
[]
[]
[]
[]
[]
[]
[]
[]
[]
[]
[]
[]
[]
[]
[]
[]
[]
[]
[]
[]
[]
[]
[]
[]
[]
[]
[]
[]
[]
[]
["Last Row"]

{"sheet":"Dropdowns","index":8,"n_rows":16,"n_cols":8,"rows_kept":16,"cut":false,"hidden":true,"merged":[]}
[]
[]
["Sector Dropdown",null,"Category Dropdowns"]
["Residential",null,"Residential","Commercial"]
["Commercial",null,"HVAC","HVAC"]
[null,null,"Lighting Upgrade","Lighting Upgrade"]
[null,null,"Water Heating","Refrigeration"]
[]
[]
["Measure Dropdown Chooser",null,"Conc. Lookup","Sector Start","Sector Count","Category Start","Category Count","DD Range"]
["Residential","HVAC",{"$f":"A11&B11","v":"ResidentialHVAC"},{"$f":"MATCH(Dropdowns!A11,Data!A:A,0)","v":2},{"$f":"COUNTIF(Data!A:A,Dropdowns!A11)","v":44},{"$f":"MATCH(B11,OFFSET(Data!$A$1,MATCH(Dropdowns!A11,Data!A:A,0)-1,1,COUNTIF(Data!A:A,Dropdowns!A11),1),0)+D11-1","v":14},{"$f":"COUNTIF(OFFSET(Data!$A$1,MATCH(Dropdowns!A11,Data!A:A,0)-1,1,COUNTIF(Data!A:A,Dropdowns!A11),1),B11)","v":32},{"$f":"\"Data!C\"&F11&\":C\"&F11+G11-1","v":"Data!C14:C45"}]
["Residential","Lighting Upgrade",{"$f":"A12&B12","v":"ResidentialLighting Upgrade"},{"$f":"MATCH(Dropdowns!A12,Data!A:A,0)","v":2},{"$f":"COUNTIF(Data!A:A,Dropdowns!A12)","v":44},{"$f":"MATCH(B12,OFFSET(Data!$A$1,MATCH(Dropdowns!A12,Data!A:A,0)-1,1,COUNTIF(Data!A:A,Dropdowns!A12),1),0)+D12-1","v":2},{"$f":"COUNTIF(OFFSET(Data!$A$1,MATCH(Dropdowns!A12,Data!A:A,0)-1,1,COUNTIF(Data!A:A,Dropdowns!A12),1),B12)","v":3},{"$f":"\"Data!C\"&F12&\":C\"&F12+G12-1","v":"Data!C2:C4"}]
["Residential","Water Heating","ResidentialWater Heating",{"$f":"MATCH(Dropdowns!A13,Data!A:A,0)","v":2},{"$f":"COUNTIF(Data!A:A,Dropdowns!A13)","v":44},{"$f":"MATCH(B13,OFFSET(Data!$A$1,MATCH(Dropdowns!A13,Data!A:A,0)-1,1,COUNTIF(Data!A:A,Dropdowns!A13),1),0)+D13-1","v":5},{"$f":"COUNTIF(OFFSET(Data!$A$1,MATCH(Dropdowns!A13,Data!A:A,0)-1,1,COUNTIF(Data!A:A,Dropdowns!A13),1),B13)","v":9},"Data!C5:C13"]
["Commercial","HVAC","CommercialHVAC",{"$f":"MATCH(Dropdowns!A14,Data!A:A,0)","v":46},{"$f":"COUNTIF(Data!A:A,Dropdowns!A14)","v":85},{"$f":"MATCH(B14,OFFSET(Data!$A$1,MATCH(Dropdowns!A14,Data!A:A,0)-1,1,COUNTIF(Data!A:A,Dropdowns!A14),1),0)+D14-1","v":83},{"$f":"COUNTIF(OFFSET(Data!$A$1,MATCH(Dropdowns!A14,Data!A:A,0)-1,1,COUNTIF(Data!A:A,Dropdowns!A14),1),B14)","v":48},"Data!C83:C130"]
["Commercial","Lighting Upgrade","CommercialLighting Upgrade",{"$f":"MATCH(Dropdowns!A15,Data!A:A,0)","v":46},{"$f":"COUNTIF(Data!A:A,Dropdowns!A15)","v":85},{"$f":"MATCH(B15,OFFSET(Data!$A$1,MATCH(Dropdowns!A15,Data!A:A,0)-1,1,COUNTIF(Data!A:A,Dropdowns!A15),1),0)+D15-1","v":46},{"$f":"COUNTIF(OFFSET(Data!$A$1,MATCH(Dropdowns!A15,Data!A:A,0)-1,1,COUNTIF(Data!A:A,Dropdowns!A15),1),B15)","v":26},"Data!C46:C71"]
["Commercial","Refrigeration","CommercialRefrigeration",{"$f":"MATCH(Dropdowns!A16,Data!A:A,0)","v":46},{"$f":"COUNTIF(Data!A:A,Dropdowns!A16)","v":85},{"$f":"MATCH(B16,OFFSET(Data!$A$1,MATCH(Dropdowns!A16,Data!A:A,0)-1,1,COUNTIF(Data!A:A,Dropdowns!A16),1),0)+D16-1","v":72},{"$f":"COUNTIF(OFFSET(Data!$A$1,MATCH(Dropdowns!A16,Data!A:A,0)-1,1,COUNTIF(Data!A:A,Dropdowns!A16),1),B16)","v":11},"Data!C72:C82"]

{"sheet":"Lifetime&PlotData","index":9,"n_rows":66,"n_cols":41,"rows_kept":66,"cut":false,"hidden":true,"merged":[]}
["Don't delete this row",null,{"$f":"ROW(Calculations!C26)","v":26},{"$f":"C1+1","v":27},{"$f":"D1+1","v":28},29,30,31,32,33,34,35,null,null,null,{"$f":"ROW(Calculations!C26)","v":26},{"$f":"P1+1","v":27},{"$f":"Q1+1","v":28},29,30,31,32,33,34,35]
[null,"Total Electricity Savings (kWh)",null,null,null,null,null,null,null,null,null,null,null,null,"Total Fossil Fuel Savings (Therms)",null,null,null,null,null,null,null,null,null,null,null,null,"Total Energy Savings (GJ)"]
[null,"Multiplication Factor",{"$f":"IF(C4-INT(C4)=0,1,C4-INT(C4))","v":1},{"$f":"IF(D4-INT(D4)=0,1,D4-INT(D4))","v":1},1,1,1,1,1,1,1,1,null,null,"Multiplication Factor",{"$f":"IF(P4-INT(P4)=0,1,P4-INT(P4))","v":1},{"$f":"IF(Q4-INT(Q4)=0,1,Q4-INT(Q4))","v":1},1,1,1,1,1,1,1,1,null,null,"Multiplication Factor",{"$f":"IF(AC4-INT(AC4)=0,1,AC4-INT(AC4))","v":1},{"$f":"IF(AD4-INT(AD4)=0,1,AD4-INT(AD4))","v":1},1,1,1,1,1,1,1,1]
[null,"Lifetime",{"$f":"IF(INDIRECT(\"Calculations!r\"&C$1)=\"\",0,INDIRECT(\"Calculations!r\"&C$1))","v":0},{"$f":"IF(INDIRECT(\"Calculations!r\"&D$1)=\"\",0,INDIRECT(\"Calculations!r\"&D$1))","v":0},0,0,0,0,0,0,0,0,null,null,"Lifetime",{"$f":"C4","v":0},0,0,0,0,0,0,0,0,{"$f":"L4","v":0},null,null,"Lifetime",{"$f":"P4","v":0},{"$f":"Q4","v":0},{"$f":"R4","v":0},{"$f":"S4","v":0},{"$f":"T4","v":0},{"$f":"U4","v":0},{"$f":"V4","v":0},{"$f":"W4","v":0},{"$f":"X4","v":0},{"$f":"Y4","v":0}]
[null,"Degradation",{"$f":"IF(INDIRECT(\"Calculations!s\"&C$1)=\"\",0,INDIRECT(\"Calculations!s\"&C$1))","v":0},{"$f":"IF(INDIRECT(\"Calculations!s\"&D$1)=\"\",0,INDIRECT(\"Calculations!s\"&D$1))","v":0},0,0,0,0,0,0,0,0,null,null,"Degradation",0,0,0,0,0,0,0,0,0,{"$f":"L5","v":0},null,null,"Degradation",{"$f":"P5","v":0},0,0,0,0,0,0,0,0,0]
[null,"Measure #",1,{"$f":"C6+1","v":2},{"$f":"D6+1","v":3},4,5,6,7,8,9,10,"Total",null,"Measure #",1,{"$f":"P6+1","v":2},{"$f":"Q6+1","v":3},4,5,6,7,8,9,10,"Total",null,"Measure #",1,{"$f":"AC6+1","v":2},{"$f":"AD6+1","v":3},4,5,6,7,8,9,10,"Total"]
[null,1,{"$f":"IF(INDIRECT(\"Calculations!p\"&C$1)=\"\",0,IF(INDIRECT(\"Calculations!F\"&C1)=\"kWh per Unit\",INDIRECT(\"Calculations!p\"&C$1),0))","v":0},{"$f":"IF(INDIRECT(\"Calculations!p\"&D$1)=\"\",0,IF(INDIRECT(\"Calculations!F\"&D1)=\"kWh per Unit\",INDIRECT(\"Calculations!p\"&D$1),0))","v":0},0,0,0,0,0,0,0,0,{"$f":"SUM(C7:L7)","v":0},null,1,{"$f":"IF(INDIRECT(\"Calculations!p\"&P$1)=\"\",0,IF(INDIRECT(\"Calculations!F\"&P1)=\"Therms per Unit\",INDIRECT(\"Calculations!p\"&P$1),0))","v":0},{"$f":"IF(INDIRECT(\"Calculations!p\"&Q$1)=\"\",0,IF(INDIRECT(\"Calculations!F\"&Q1)=\"Therms per Unit\",INDIRECT(\"Calculations!p\"&Q$1),0))","v":0},0,0,0,0,0,0,0,0,{"$f":"SUM(P7:Y7)","v":0},null,1,{"$f":"C7*Conversions!$K$50+P7*Conversions!$K$59","v":0},{"$f":"D7*Conversions!$K$50+Q7*Conversions!$K$59","v":0},{"$f":"E7*Conversions!$K$50+R7*Conversions!$K$59","v":0},{"$f":"F7*Conversions!$K$50+S7*Conversions!$K$59","v":0},{"$f":"G7*Conversions!$K$50+T7*Conversions!$K$59","v":0},{"$f":"H7*Conversions!$K$50+U7*Conversions!$K$59","v":0},{"$f":"I7*Conversions!$K$50+V7*Conversions!$K$59","v":0},{"$f":"J7*Conversions!$K$50+W7*Conversions!$K$59","v":0},{"$f":"K7*Conversions!$K$50+X7*Conversions!$K$59","v":0},{"$f":"L7*Conversions!$K$50+Y7*Conversions!$K$59","v":0},{"$f":"SUM(AC7:AL7)","v":0},{"$f":"IF(SUM(AC7:AL7)=0,FALSE,TRUE)","v":false}]
[null,2,{"$f":"IF(AND($B8>=C$4,$B8<C$4+1),C7*(1-C$5)*C$3,IF($B8<C$4,C7*(1-C$5),0))","v":0},{"$f":"IF(AND($B8>=D$4,$B8<D$4+1),D7*(1-D$5)*D$3,IF($B8<D$4,D7*(1-D$5),0))","v":0},{"$f":"IF(AND($B8>=E$4,$B8<E$4+1),E7*(1-E$5)*E$3,IF($B8<E$4,E7*(1-E$5),0))","v":0},{"$f":"IF(AND($B8>=F$4,$B8<F$4+1),F7*(1-F$5)*F$3,IF($B8<F$4,F7*(1-F$5),0))","v":0},{"$f":"IF(AND($B8>=G$4,$B8<G$4+1),G7*(1-G$5)*G$3,IF($B8<G$4,G7*(1-G$5),0))","v":0},0,0,0,{"$f":"IF(AND($B8>=K$4,$B8<K$4+1),K7*(1-K$5)*K$3,IF($B8<K$4,K7*(1-K$5),0))","v":0},{"$f":"IF(AND($B8>=L$4,$B8<L$4+1),L7*(1-L$5)*L$3,IF($B8<L$4,L7*(1-L$5),0))","v":0},0,null,2,{"$f":"IF(AND($B8>=P$4,$B8<P$4+1),P7*(1-P$5)*P$3,IF($B8<P$4,P7*(1-P$5),0))","v":0},{"$f":"IF(AND($B8>=Q$4,$B8<Q$4+1),Q7*(1-Q$5)*Q$3,IF($B8<Q$4,Q7*(1-Q$5),0))","v":0},{"$f":"IF(AND($B8>=R$4,$B8<R$4+1),R7*(1-R$5)*R$3,IF($B8<R$4,R7*(1-R$5),0))","v":0},{"$f":"IF(AND($B8>=S$4,$B8<S$4+1),S7*(1-S$5)*S$3,IF($B8<S$4,S7*(1-S$5),0))","v":0},{"$f":"IF(AND($B8>=T$4,$B8<T$4+1),T7*(1-T$5)*T$3,IF($B8<T$4,T7*(1-T$5),0))","v":0},0,0,0,{"$f":"IF(AND($B8>=X$4,$B8<X$4+1),X7*(1-X$5)*X$3,IF($B8<X$4,X7*(1-X$5),0))","v":0},{"$f":"IF(AND($B8>=Y$4,$B8<Y$4+1),Y7*(1-Y$5)*Y$3,IF($B8<Y$4,Y7*(1-Y$5),0))","v":0},{"$f":"SUM(P8:Y8)","v":0},null,2,{"$f":"C8*Conversions!$K$50+P8*Conversions!$K$59","v":0},{"$f":"D8*Conversions!$K$50+Q8*Conversions!$K$59","v":0},{"$f":"E8*Conversions!$K$50+R8*Conversions!$K$59","v":0},{"$f":"F8*Conversions!$K$50+S8*Conversions!$K$59","v":0},{"$f":"G8*Conversions!$K$50+T8*Conversions!$K$59","v":0},{"$f":"H8*Conversions!$K$50+U8*Conversions!$K$59","v":0},{"$f":"I8*Conversions!$K$50+V8*Conversions!$K$59","v":0},{"$f":"J8*Conversions!$K$50+W8*Conversions!$K$59","v":0},{"$f":"K8*Conversions!$K$50+X8*Conversions!$K$59","v":0},{"$f":"L8*Conversions!$K$50+Y8*Conversions!$K$59","v":0},{"$f":"SUM(AC8:AL8)","v":0},{"$f":"IF(SUM(AC8:AL8)=0,FALSE,TRUE)","v":false}]
[null,3,0,0,0,0,0,0,0,0,{"$f":"IF(AND($B9>=K$4,$B9<K$4+1),K8*(1-K$5)*K$3,IF($B9<K$4,K8*(1-K$5),0))","v":0},0,0,null,3,0,0,0,0,0,0,0,0,{"$f":"IF(AND($B9>=X$4,$B9<X$4+1),X8*(1-X$5)*X$3,IF($B9<X$4,X8*(1-X$5),0))","v":0},0,0,null,3,{"$f":"C9*Conversions!$K$50+P9*Conversions!$K$59","v":0},{"$f":"D9*Conversions!$K$50+Q9*Conversions!$K$59","v":0},{"$f":"E9*Conversions!$K$50+R9*Conversions!$K$59","v":0},{"$f":"F9*Conversions!$K$50+S9*Conversions!$K$59","v":0},{"$f":"G9*Conversions!$K$50+T9*Conversions!$K$59","v":0},{"$f":"H9*Conversions!$K$50+U9*Conversions!$K$59","v":0},{"$f":"I9*Conversions!$K$50+V9*Conversions!$K$59","v":0},{"$f":"J9*Conversions!$K$50+W9*Conversions!$K$59","v":0},{"$f":"K9*Conversions!$K$50+X9*Conversions!$K$59","v":0},{"$f":"L9*Conversions!$K$50+Y9*Conversions!$K$59","v":0},0,false]
[null,4,0,0,0,0,0,0,0,0,{"$f":"IF(AND($B10>=K$4,$B10<K$4+1),K9*(1-K$5)*K$3,IF($B10<K$4,K9*(1-K$5),0))","v":0},0,0,null,4,0,0,0,0,0,0,0,0,{"$f":"IF(AND($B10>=X$4,$B10<X$4+1),X9*(1-X$5)*X$3,IF($B10<X$4,X9*(1-X$5),0))","v":0},0,0,null,4,{"$f":"C10*Conversions!$K$50+P10*Conversions!$K$59","v":0},{"$f":"D10*Conversions!$K$50+Q10*Conversions!$K$59","v":0},{"$f":"E10*Conversions!$K$50+R10*Conversions!$K$59","v":0},{"$f":"F10*Conversions!$K$50+S10*Conversions!$K$59","v":0},{"$f":"G10*Conversions!$K$50+T10*Conversions!$K$59","v":0},{"$f":"H10*Conversions!$K$50+U10*Conversions!$K$59","v":0},{"$f":"I10*Conversions!$K$50+V10*Conversions!$K$59","v":0},{"$f":"J10*Conversions!$K$50+W10*Conversions!$K$59","v":0},{"$f":"K10*Conversions!$K$50+X10*Conversions!$K$59","v":0},{"$f":"L10*Conversions!$K$50+Y10*Conversions!$K$59","v":0},0,false]
[null,5,0,0,0,0,0,0,0,0,{"$f":"IF(AND($B11>=K$4,$B11<K$4+1),K10*(1-K$5)*K$3,IF($B11<K$4,K10*(1-K$5),0))","v":0},0,0,null,5,0,0,0,0,0,0,0,0,{"$f":"IF(AND($B11>=X$4,$B11<X$4+1),X10*(1-X$5)*X$3,IF($B11<X$4,X10*(1-X$5),0))","v":0},0,0,null,5,{"$f":"C11*Conversions!$K$50+P11*Conversions!$K$59","v":0},{"$f":"D11*Conversions!$K$50+Q11*Conversions!$K$59","v":0},{"$f":"E11*Conversions!$K$50+R11*Conversions!$K$59","v":0},{"$f":"F11*Conversions!$K$50+S11*Conversions!$K$59","v":0},{"$f":"G11*Conversions!$K$50+T11*Conversions!$K$59","v":0},{"$f":"H11*Conversions!$K$50+U11*Conversions!$K$59","v":0},{"$f":"I11*Conversions!$K$50+V11*Conversions!$K$59","v":0},{"$f":"J11*Conversions!$K$50+W11*Conversions!$K$59","v":0},{"$f":"K11*Conversions!$K$50+X11*Conversions!$K$59","v":0},{"$f":"L11*Conversions!$K$50+Y11*Conversions!$K$59","v":0},0,false]
[null,6,0,0,0,0,0,0,0,0,{"$f":"IF(AND($B12>=K$4,$B12<K$4+1),K11*(1-K$5)*K$3,IF($B12<K$4,K11*(1-K$5),0))","v":0},0,0,null,6,0,0,0,0,0,0,0,0,{"$f":"IF(AND($B12>=X$4,$B12<X$4+1),X11*(1-X$5)*X$3,IF($B12<X$4,X11*(1-X$5),0))","v":0},0,0,null,6,{"$f":"C12*Conversions!$K$50+P12*Conversions!$K$59","v":0},{"$f":"D12*Conversions!$K$50+Q12*Conversions!$K$59","v":0},{"$f":"E12*Conversions!$K$50+R12*Conversions!$K$59","v":0},{"$f":"F12*Conversions!$K$50+S12*Conversions!$K$59","v":0},{"$f":"G12*Conversions!$K$50+T12*Conversions!$K$59","v":0},{"$f":"H12*Conversions!$K$50+U12*Conversions!$K$59","v":0},{"$f":"I12*Conversions!$K$50+V12*Conversions!$K$59","v":0},{"$f":"J12*Conversions!$K$50+W12*Conversions!$K$59","v":0},{"$f":"K12*Conversions!$K$50+X12*Conversions!$K$59","v":0},{"$f":"L12*Conversions!$K$50+Y12*Conversions!$K$59","v":0},0,false]
[null,7,0,0,0,0,0,0,0,0,{"$f":"IF(AND($B13>=K$4,$B13<K$4+1),K12*(1-K$5)*K$3,IF($B13<K$4,K12*(1-K$5),0))","v":0},0,0,null,7,0,0,0,0,0,0,0,0,{"$f":"IF(AND($B13>=X$4,$B13<X$4+1),X12*(1-X$5)*X$3,IF($B13<X$4,X12*(1-X$5),0))","v":0},0,0,null,7,{"$f":"C13*Conversions!$K$50+P13*Conversions!$K$59","v":0},{"$f":"D13*Conversions!$K$50+Q13*Conversions!$K$59","v":0},{"$f":"E13*Conversions!$K$50+R13*Conversions!$K$59","v":0},{"$f":"F13*Conversions!$K$50+S13*Conversions!$K$59","v":0},{"$f":"G13*Conversions!$K$50+T13*Conversions!$K$59","v":0},{"$f":"H13*Conversions!$K$50+U13*Conversions!$K$59","v":0},{"$f":"I13*Conversions!$K$50+V13*Conversions!$K$59","v":0},{"$f":"J13*Conversions!$K$50+W13*Conversions!$K$59","v":0},{"$f":"K13*Conversions!$K$50+X13*Conversions!$K$59","v":0},{"$f":"L13*Conversions!$K$50+Y13*Conversions!$K$59","v":0},0,false]
[null,8,0,0,0,0,0,0,0,0,{"$f":"IF(AND($B14>=K$4,$B14<K$4+1),K13*(1-K$5)*K$3,IF($B14<K$4,K13*(1-K$5),0))","v":0},0,0,null,8,0,0,0,0,0,0,0,0,{"$f":"IF(AND($B14>=X$4,$B14<X$4+1),X13*(1-X$5)*X$3,IF($B14<X$4,X13*(1-X$5),0))","v":0},0,0,null,8,{"$f":"C14*Conversions!$K$50+P14*Conversions!$K$59","v":0},{"$f":"D14*Conversions!$K$50+Q14*Conversions!$K$59","v":0},{"$f":"E14*Conversions!$K$50+R14*Conversions!$K$59","v":0},{"$f":"F14*Conversions!$K$50+S14*Conversions!$K$59","v":0},{"$f":"G14*Conversions!$K$50+T14*Conversions!$K$59","v":0},{"$f":"H14*Conversions!$K$50+U14*Conversions!$K$59","v":0},{"$f":"I14*Conversions!$K$50+V14*Conversions!$K$59","v":0},{"$f":"J14*Conversions!$K$50+W14*Conversions!$K$59","v":0},{"$f":"K14*Conversions!$K$50+X14*Conversions!$K$59","v":0},{"$f":"L14*Conversions!$K$50+Y14*Conversions!$K$59","v":0},0,false]
[null,9,0,0,0,0,0,0,0,0,{"$f":"IF(AND($B15>=K$4,$B15<K$4+1),K14*(1-K$5)*K$3,IF($B15<K$4,K14*(1-K$5),0))","v":0},0,0,null,9,0,0,0,0,0,0,0,0,{"$f":"IF(AND($B15>=X$4,$B15<X$4+1),X14*(1-X$5)*X$3,IF($B15<X$4,X14*(1-X$5),0))","v":0},0,0,null,9,{"$f":"C15*Conversions!$K$50+P15*Conversions!$K$59","v":0},{"$f":"D15*Conversions!$K$50+Q15*Conversions!$K$59","v":0},{"$f":"E15*Conversions!$K$50+R15*Conversions!$K$59","v":0},{"$f":"F15*Conversions!$K$50+S15*Conversions!$K$59","v":0},{"$f":"G15*Conversions!$K$50+T15*Conversions!$K$59","v":0},{"$f":"H15*Conversions!$K$50+U15*Conversions!$K$59","v":0},{"$f":"I15*Conversions!$K$50+V15*Conversions!$K$59","v":0},{"$f":"J15*Conversions!$K$50+W15*Conversions!$K$59","v":0},{"$f":"K15*Conversions!$K$50+X15*Conversions!$K$59","v":0},{"$f":"L15*Conversions!$K$50+Y15*Conversions!$K$59","v":0},0,false]
[null,10,0,0,0,0,0,0,0,0,{"$f":"IF(AND($B16>=K$4,$B16<K$4+1),K15*(1-K$5)*K$3,IF($B16<K$4,K15*(1-K$5),0))","v":0},0,0,null,10,0,0,0,0,0,0,0,0,{"$f":"IF(AND($B16>=X$4,$B16<X$4+1),X15*(1-X$5)*X$3,IF($B16<X$4,X15*(1-X$5),0))","v":0},0,0,null,10,{"$f":"C16*Conversions!$K$50+P16*Conversions!$K$59","v":0},{"$f":"D16*Conversions!$K$50+Q16*Conversions!$K$59","v":0},{"$f":"E16*Conversions!$K$50+R16*Conversions!$K$59","v":0},{"$f":"F16*Conversions!$K$50+S16*Conversions!$K$59","v":0},{"$f":"G16*Conversions!$K$50+T16*Conversions!$K$59","v":0},{"$f":"H16*Conversions!$K$50+U16*Conversions!$K$59","v":0},{"$f":"I16*Conversions!$K$50+V16*Conversions!$K$59","v":0},{"$f":"J16*Conversions!$K$50+W16*Conversions!$K$59","v":0},{"$f":"K16*Conversions!$K$50+X16*Conversions!$K$59","v":0},{"$f":"L16*Conversions!$K$50+Y16*Conversions!$K$59","v":0},0,false]
[null,11,0,0,0,0,0,0,0,0,{"$f":"IF(AND($B17>=K$4,$B17<K$4+1),K16*(1-K$5)*K$3,IF($B17<K$4,K16*(1-K$5),0))","v":0},0,0,null,11,0,0,0,0,0,0,0,0,{"$f":"IF(AND($B17>=X$4,$B17<X$4+1),X16*(1-X$5)*X$3,IF($B17<X$4,X16*(1-X$5),0))","v":0},0,0,null,11,{"$f":"C17*Conversions!$K$50+P17*Conversions!$K$59","v":0},{"$f":"D17*Conversions!$K$50+Q17*Conversions!$K$59","v":0},{"$f":"E17*Conversions!$K$50+R17*Conversions!$K$59","v":0},{"$f":"F17*Conversions!$K$50+S17*Conversions!$K$59","v":0},{"$f":"G17*Conversions!$K$50+T17*Conversions!$K$59","v":0},{"$f":"H17*Conversions!$K$50+U17*Conversions!$K$59","v":0},{"$f":"I17*Conversions!$K$50+V17*Conversions!$K$59","v":0},{"$f":"J17*Conversions!$K$50+W17*Conversions!$K$59","v":0},{"$f":"K17*Conversions!$K$50+X17*Conversions!$K$59","v":0},{"$f":"L17*Conversions!$K$50+Y17*Conversions!$K$59","v":0},0,false]
[null,12,0,0,0,0,0,0,0,0,{"$f":"IF(AND($B18>=K$4,$B18<K$4+1),K17*(1-K$5)*K$3,IF($B18<K$4,K17*(1-K$5),0))","v":0},0,0,null,12,0,0,0,0,0,0,0,0,{"$f":"IF(AND($B18>=X$4,$B18<X$4+1),X17*(1-X$5)*X$3,IF($B18<X$4,X17*(1-X$5),0))","v":0},0,0,null,12,{"$f":"C18*Conversions!$K$50+P18*Conversions!$K$59","v":0},{"$f":"D18*Conversions!$K$50+Q18*Conversions!$K$59","v":0},{"$f":"E18*Conversions!$K$50+R18*Conversions!$K$59","v":0},{"$f":"F18*Conversions!$K$50+S18*Conversions!$K$59","v":0},{"$f":"G18*Conversions!$K$50+T18*Conversions!$K$59","v":0},{"$f":"H18*Conversions!$K$50+U18*Conversions!$K$59","v":0},{"$f":"I18*Conversions!$K$50+V18*Conversions!$K$59","v":0},{"$f":"J18*Conversions!$K$50+W18*Conversions!$K$59","v":0},{"$f":"K18*Conversions!$K$50+X18*Conversions!$K$59","v":0},{"$f":"L18*Conversions!$K$50+Y18*Conversions!$K$59","v":0},0,false]
[null,13,0,0,0,0,0,0,0,0,{"$f":"IF(AND($B19>=K$4,$B19<K$4+1),K18*(1-K$5)*K$3,IF($B19<K$4,K18*(1-K$5),0))","v":0},0,0,null,13,0,0,0,0,0,0,0,0,{"$f":"IF(AND($B19>=X$4,$B19<X$4+1),X18*(1-X$5)*X$3,IF($B19<X$4,X18*(1-X$5),0))","v":0},0,0,null,13,{"$f":"C19*Conversions!$K$50+P19*Conversions!$K$59","v":0},{"$f":"D19*Conversions!$K$50+Q19*Conversions!$K$59","v":0},{"$f":"E19*Conversions!$K$50+R19*Conversions!$K$59","v":0},{"$f":"F19*Conversions!$K$50+S19*Conversions!$K$59","v":0},{"$f":"G19*Conversions!$K$50+T19*Conversions!$K$59","v":0},{"$f":"H19*Conversions!$K$50+U19*Conversions!$K$59","v":0},{"$f":"I19*Conversions!$K$50+V19*Conversions!$K$59","v":0},{"$f":"J19*Conversions!$K$50+W19*Conversions!$K$59","v":0},{"$f":"K19*Conversions!$K$50+X19*Conversions!$K$59","v":0},{"$f":"L19*Conversions!$K$50+Y19*Conversions!$K$59","v":0},0,false]
[null,14,0,0,0,0,0,0,0,0,{"$f":"IF(AND($B20>=K$4,$B20<K$4+1),K19*(1-K$5)*K$3,IF($B20<K$4,K19*(1-K$5),0))","v":0},0,0,null,14,0,0,0,0,0,0,0,0,{"$f":"IF(AND($B20>=X$4,$B20<X$4+1),X19*(1-X$5)*X$3,IF($B20<X$4,X19*(1-X$5),0))","v":0},0,0,null,14,{"$f":"C20*Conversions!$K$50+P20*Conversions!$K$59","v":0},{"$f":"D20*Conversions!$K$50+Q20*Conversions!$K$59","v":0},{"$f":"E20*Conversions!$K$50+R20*Conversions!$K$59","v":0},{"$f":"F20*Conversions!$K$50+S20*Conversions!$K$59","v":0},{"$f":"G20*Conversions!$K$50+T20*Conversions!$K$59","v":0},{"$f":"H20*Conversions!$K$50+U20*Conversions!$K$59","v":0},{"$f":"I20*Conversions!$K$50+V20*Conversions!$K$59","v":0},{"$f":"J20*Conversions!$K$50+W20*Conversions!$K$59","v":0},{"$f":"K20*Conversions!$K$50+X20*Conversions!$K$59","v":0},{"$f":"L20*Conversions!$K$50+Y20*Conversions!$K$59","v":0},0,false]
[null,15,0,0,0,0,0,0,0,0,{"$f":"IF(AND($B21>=K$4,$B21<K$4+1),K20*(1-K$5)*K$3,IF($B21<K$4,K20*(1-K$5),0))","v":0},0,0,null,15,0,0,0,0,0,0,0,0,{"$f":"IF(AND($B21>=X$4,$B21<X$4+1),X20*(1-X$5)*X$3,IF($B21<X$4,X20*(1-X$5),0))","v":0},0,0,null,15,{"$f":"C21*Conversions!$K$50+P21*Conversions!$K$59","v":0},{"$f":"D21*Conversions!$K$50+Q21*Conversions!$K$59","v":0},{"$f":"E21*Conversions!$K$50+R21*Conversions!$K$59","v":0},{"$f":"F21*Conversions!$K$50+S21*Conversions!$K$59","v":0},{"$f":"G21*Conversions!$K$50+T21*Conversions!$K$59","v":0},{"$f":"H21*Conversions!$K$50+U21*Conversions!$K$59","v":0},{"$f":"I21*Conversions!$K$50+V21*Conversions!$K$59","v":0},{"$f":"J21*Conversions!$K$50+W21*Conversions!$K$59","v":0},{"$f":"K21*Conversions!$K$50+X21*Conversions!$K$59","v":0},{"$f":"L21*Conversions!$K$50+Y21*Conversions!$K$59","v":0},0,false]
[null,16,0,0,0,0,0,0,0,0,{"$f":"IF(AND($B22>=K$4,$B22<K$4+1),K21*(1-K$5)*K$3,IF($B22<K$4,K21*(1-K$5),0))","v":0},0,0,null,16,0,0,0,0,0,0,0,0,{"$f":"IF(AND($B22>=X$4,$B22<X$4+1),X21*(1-X$5)*X$3,IF($B22<X$4,X21*(1-X$5),0))","v":0},0,0,null,16,{"$f":"C22*Conversions!$K$50+P22*Conversions!$K$59","v":0},{"$f":"D22*Conversions!$K$50+Q22*Conversions!$K$59","v":0},{"$f":"E22*Conversions!$K$50+R22*Conversions!$K$59","v":0},{"$f":"F22*Conversions!$K$50+S22*Conversions!$K$59","v":0},{"$f":"G22*Conversions!$K$50+T22*Conversions!$K$59","v":0},{"$f":"H22*Conversions!$K$50+U22*Conversions!$K$59","v":0},{"$f":"I22*Conversions!$K$50+V22*Conversions!$K$59","v":0},{"$f":"J22*Conversions!$K$50+W22*Conversions!$K$59","v":0},{"$f":"K22*Conversions!$K$50+X22*Conversions!$K$59","v":0},{"$f":"L22*Conversions!$K$50+Y22*Conversions!$K$59","v":0},0,false]
[null,17,0,0,0,0,0,0,0,0,{"$f":"IF(AND($B23>=K$4,$B23<K$4+1),K22*(1-K$5)*K$3,IF($B23<K$4,K22*(1-K$5),0))","v":0},0,0,null,17,0,0,0,0,0,0,0,0,{"$f":"IF(AND($B23>=X$4,$B23<X$4+1),X22*(1-X$5)*X$3,IF($B23<X$4,X22*(1-X$5),0))","v":0},0,0,null,17,{"$f":"C23*Conversions!$K$50+P23*Conversions!$K$59","v":0},{"$f":"D23*Conversions!$K$50+Q23*Conversions!$K$59","v":0},{"$f":"E23*Conversions!$K$50+R23*Conversions!$K$59","v":0},{"$f":"F23*Conversions!$K$50+S23*Conversions!$K$59","v":0},{"$f":"G23*Conversions!$K$50+T23*Conversions!$K$59","v":0},{"$f":"H23*Conversions!$K$50+U23*Conversions!$K$59","v":0},{"$f":"I23*Conversions!$K$50+V23*Conversions!$K$59","v":0},{"$f":"J23*Conversions!$K$50+W23*Conversions!$K$59","v":0},{"$f":"K23*Conversions!$K$50+X23*Conversions!$K$59","v":0},{"$f":"L23*Conversions!$K$50+Y23*Conversions!$K$59","v":0},0,false]
[null,18,0,0,0,0,0,0,0,0,{"$f":"IF(AND($B24>=K$4,$B24<K$4+1),K23*(1-K$5)*K$3,IF($B24<K$4,K23*(1-K$5),0))","v":0},0,0,null,18,0,0,0,0,0,0,0,0,{"$f":"IF(AND($B24>=X$4,$B24<X$4+1),X23*(1-X$5)*X$3,IF($B24<X$4,X23*(1-X$5),0))","v":0},0,0,null,18,{"$f":"C24*Conversions!$K$50+P24*Conversions!$K$59","v":0},{"$f":"D24*Conversions!$K$50+Q24*Conversions!$K$59","v":0},{"$f":"E24*Conversions!$K$50+R24*Conversions!$K$59","v":0},{"$f":"F24*Conversions!$K$50+S24*Conversions!$K$59","v":0},{"$f":"G24*Conversions!$K$50+T24*Conversions!$K$59","v":0},{"$f":"H24*Conversions!$K$50+U24*Conversions!$K$59","v":0},{"$f":"I24*Conversions!$K$50+V24*Conversions!$K$59","v":0},{"$f":"J24*Conversions!$K$50+W24*Conversions!$K$59","v":0},{"$f":"K24*Conversions!$K$50+X24*Conversions!$K$59","v":0},{"$f":"L24*Conversions!$K$50+Y24*Conversions!$K$59","v":0},0,false]
[null,19,0,0,0,0,0,0,0,0,{"$f":"IF(AND($B25>=K$4,$B25<K$4+1),K24*(1-K$5)*K$3,IF($B25<K$4,K24*(1-K$5),0))","v":0},0,0,null,19,0,0,0,0,0,0,0,0,{"$f":"IF(AND($B25>=X$4,$B25<X$4+1),X24*(1-X$5)*X$3,IF($B25<X$4,X24*(1-X$5),0))","v":0},0,0,null,19,{"$f":"C25*Conversions!$K$50+P25*Conversions!$K$59","v":0},{"$f":"D25*Conversions!$K$50+Q25*Conversions!$K$59","v":0},{"$f":"E25*Conversions!$K$50+R25*Conversions!$K$59","v":0},{"$f":"F25*Conversions!$K$50+S25*Conversions!$K$59","v":0},{"$f":"G25*Conversions!$K$50+T25*Conversions!$K$59","v":0},{"$f":"H25*Conversions!$K$50+U25*Conversions!$K$59","v":0},{"$f":"I25*Conversions!$K$50+V25*Conversions!$K$59","v":0},{"$f":"J25*Conversions!$K$50+W25*Conversions!$K$59","v":0},{"$f":"K25*Conversions!$K$50+X25*Conversions!$K$59","v":0},{"$f":"L25*Conversions!$K$50+Y25*Conversions!$K$59","v":0},0,false]
[null,20,0,0,0,0,0,0,0,0,{"$f":"IF(AND($B26>=K$4,$B26<K$4+1),K25*(1-K$5)*K$3,IF($B26<K$4,K25*(1-K$5),0))","v":0},0,0,null,20,0,0,0,0,0,0,0,0,{"$f":"IF(AND($B26>=X$4,$B26<X$4+1),X25*(1-X$5)*X$3,IF($B26<X$4,X25*(1-X$5),0))","v":0},0,0,null,20,{"$f":"C26*Conversions!$K$50+P26*Conversions!$K$59","v":0},{"$f":"D26*Conversions!$K$50+Q26*Conversions!$K$59","v":0},{"$f":"E26*Conversions!$K$50+R26*Conversions!$K$59","v":0},{"$f":"F26*Conversions!$K$50+S26*Conversions!$K$59","v":0},{"$f":"G26*Conversions!$K$50+T26*Conversions!$K$59","v":0},{"$f":"H26*Conversions!$K$50+U26*Conversions!$K$59","v":0},{"$f":"I26*Conversions!$K$50+V26*Conversions!$K$59","v":0},{"$f":"J26*Conversions!$K$50+W26*Conversions!$K$59","v":0},{"$f":"K26*Conversions!$K$50+X26*Conversions!$K$59","v":0},{"$f":"L26*Conversions!$K$50+Y26*Conversions!$K$59","v":0},0,false]
[null,"Total",{"$f":"SUM(C7:C26)","v":0},0,0,0,0,{"$f":"SUM(H7:H26)","v":0},0,0,0,0,0,null,null,{"$f":"SUM(P7:P26)","v":0},0,0,0,0,{"$f":"SUM(U7:U26)","v":0},0,0,0,0,{"$f":"SUM(P27:Y27)","v":0},null,null,{"$f":"SUM(AC7:AC26)","v":0},0,0,0,0,{"$f":"SUM(AH7:AH26)","v":0},0,0,0,0,{"$f":"SUM(AC27:AL27)","v":0}]
[null,null,null,null,null,null,null,null,null,null,null,"GJ",{"$f":"M27*Conversions!K50","v":0},null,null,null,null,null,null,null,null,null,null,null,"GJ",{"$f":"Z27*Conversions!K59","v":0}]
[]
[]
[null,"Emissions Savings from Electricity (tCO2e)",null,null,null,null,null,null,null,null,null,null,null,null,"Emissions Savings from Fossil Fuel (tCO2e)",null,null,null,null,null,null,null,null,null,null,null,null,"Total Emissions Savings (tCO2e)",null,null,null,null,null,null,null,null,null,null,null,null,"Years"]
[null,"Measure #",1,{"$f":"C32+1","v":2},{"$f":"D32+1","v":3},4,5,6,7,8,9,10,"Total",null,"Measure #",1,{"$f":"P32+1","v":2},{"$f":"Q32+1","v":3},4,5,6,7,8,9,10,"Total",null,"Measure #",1,{"$f":"AC32+1","v":2},{"$f":"AD32+1","v":3},4,5,6,7,8,9,10,"Total"]
[null,1,{"$f":"C7*IF(Calculations!$F$16=\"\",Calculations!$D$16,Calculations!$F$16)/(1-IF(Calculations!$F$17=\"\",Calculations!$D$17,Calculations!$F$17))/Conversions!$D$81","v":{"$error":"#VALUE!"}},{"$f":"D7*IF(Calculations!$F$16=\"\",Calculations!$D$16,Calculations!$F$16)/(1-IF(Calculations!$F$17=\"\",Calculations!$D$17,Calculations!$F$17))/Conversions!$D$81","v":{"$error":"#VALUE!"}},{"$f":"E7*IF(Calculations!$F$16=\"\",Calculations!$D$16,Calculations!$F$16)/(1-IF(Calculations!$F$17=\"\",Calculations!$D$17,Calculations!$F$17))/Conversions!$D$81","v":{"$error":"#VALUE!"}},{"$f":"F7*IF(Calculations!$F$16=\"\",Calculations!$D$16,Calculations!$F$16)/(1-IF(Calculations!$F$17=\"\",Calculations!$D$17,Calculations!$F$17))/Conversions!$D$81","v":{"$error":"#VALUE!"}},{"$f":"G7*IF(Calculations!$F$16=\"\",Calculations!$D$16,Calculations!$F$16)/(1-IF(Calculations!$F$17=\"\",Calculations!$D$17,Calculations!$F$17))/Conversions!$D$81","v":{"$error":"#VALUE!"}},{"$f":"H7*IF(Calculations!$F$16=\"\",Calculations!$D$16,Calculations!$F$16)/(1-IF(Calculations!$F$17=\"\",Calculations!$D$17,Calculations!$F$17))/Conversions!$D$81","v":{"$error":"#VALUE!"}},{"$f":"I7*IF(Calculations!$F$16=\"\",Calculations!$D$16,Calculations!$F$16)/(1-IF(Calculations!$F$17=\"\",Calculations!$D$17,Calculations!$F$17))/Conversions!$D$81","v":{"$error":"#VALUE!"}},{"$f":"J7*IF(Calculations!$F$16=\"\",Calculations!$D$16,Calculations!$F$16)/(1-IF(Calculations!$F$17=\"\",Calculations!$D$17,Calculations!$F$17))/Conversions!$D$81","v":{"$error":"#VALUE!"}},{"$f":"K7*IF(Calculations!$F$16=\"\",Calculations!$D$16,Calculations!$F$16)/(1-IF(Calculations!$F$17=\"\",Calculations!$D$17,Calculations!$F$17))/Conversions!$D$81","v":{"$error":"#VALUE!"}},{"$f":"L7*IF(Calculations!$F$16=\"\",Calculations!$D$16,Calculations!$F$16)/(1-IF(Calculations!$F$17=\"\",Calculations!$D$17,Calculations!$F$17))/Conversions!$D$81","v":{"$error":"#VALUE!"}},{"$f":"SUM(C33:L33)","v":{"$error":"#VALUE!"}},null,1,{"$f":"P7*Conversions!$K$59*IF(Calculations!$F$18=\"\",Calculations!$D$18,Calculations!$F$18)/Conversions!$D$81","v":{"$error":"#VALUE!"}},{"$f":"Q7*Conversions!$K$59*IF(Calculations!$F$18=\"\",Calculations!$D$18,Calculations!$F$18)/Conversions!$D$81","v":{"$error":"#VALUE!"}},{"$f":"R7*Conversions!$K$59*IF(Calculations!$F$18=\"\",Calculations!$D$18,Calculations!$F$18)/Conversions!$D$81","v":{"$error":"#VALUE!"}},{"$f":"S7*Conversions!$K$59*IF(Calculations!$F$18=\"\",Calculations!$D$18,Calculations!$F$18)/Conversions!$D$81","v":{"$error":"#VALUE!"}},{"$f":"T7*Conversions!$K$59*IF(Calculations!$F$18=\"\",Calculations!$D$18,Calculations!$F$18)/Conversions!$D$81","v":{"$error":"#VALUE!"}},{"$f":"U7*Conversions!$K$59*IF(Calculations!$F$18=\"\",Calculations!$D$18,Calculations!$F$18)/Conversions!$D$81","v":{"$error":"#VALUE!"}},{"$f":"V7*Conversions!$K$59*IF(Calculations!$F$18=\"\",Calculations!$D$18,Calculations!$F$18)/Conversions!$D$81","v":{"$error":"#VALUE!"}},{"$f":"W7*Conversions!$K$59*IF(Calculations!$F$18=\"\",Calculations!$D$18,Calculations!$F$18)/Conversions!$D$81","v":{"$error":"#VALUE!"}},{"$f":"X7*Conversions!$K$59*IF(Calculations!$F$18=\"\",Calculations!$D$18,Calculations!$F$18)/Conversions!$D$81","v":{"$error":"#VALUE!"}},{"$f":"Y7*Conversions!$K$59*IF(Calculations!$F$18=\"\",Calculations!$D$18,Calculations!$F$18)/Conversions!$D$81","v":{"$error":"#VALUE!"}},{"$f":"SUM(P33:Y33)","v":{"$error":"#VALUE!"}},null,1,{"$f":"C33+P33","v":{"$error":"#VALUE!"}},{"$f":"D33+Q33","v":{"$error":"#VALUE!"}},{"$f":"E33+R33","v":{"$error":"#VALUE!"}},{"$f":"F33+S33","v":{"$error":"#VALUE!"}},{"$f":"G33+T33","v":{"$error":"#VALUE!"}},{"$f":"H33+U33","v":{"$error":"#VALUE!"}},{"$f":"I33+V33","v":{"$error":"#VALUE!"}},{"$f":"J33+W33","v":{"$error":"#VALUE!"}},{"$f":"K33+X33","v":{"$error":"#VALUE!"}},{"$f":"L33+Y33","v":{"$error":"#VALUE!"}},{"$f":"SUM(AC33:AL33)","v":{"$error":"#VALUE!"}},null,{"$f":"2013","v":2013}]
[null,2,{"$f":"C8*IF(Calculations!$F$16=\"\",Calculations!$D$16,Calculations!$F$16)/(1-IF(Calculations!$F$17=\"\",Calculations!$D$17,Calculations!$F$17))/Conversions!$D$81","v":{"$error":"#VALUE!"}},{"$f":"D8*IF(Calculations!$F$16=\"\",Calculations!$D$16,Calculations!$F$16)/(1-IF(Calculations!$F$17=\"\",Calculations!$D$17,Calculations!$F$17))/Conversions!$D$81","v":{"$error":"#VALUE!"}},{"$f":"E8*IF(Calculations!$F$16=\"\",Calculations!$D$16,Calculations!$F$16)/(1-IF(Calculations!$F$17=\"\",Calculations!$D$17,Calculations!$F$17))/Conversions!$D$81","v":{"$error":"#VALUE!"}},{"$f":"F8*IF(Calculations!$F$16=\"\",Calculations!$D$16,Calculations!$F$16)/(1-IF(Calculations!$F$17=\"\",Calculations!$D$17,Calculations!$F$17))/Conversions!$D$81","v":{"$error":"#VALUE!"}},{"$f":"G8*IF(Calculations!$F$16=\"\",Calculations!$D$16,Calculations!$F$16)/(1-IF(Calculations!$F$17=\"\",Calculations!$D$17,Calculations!$F$17))/Conversions!$D$81","v":{"$error":"#VALUE!"}},{"$f":"H8*IF(Calculations!$F$16=\"\",Calculations!$D$16,Calculations!$F$16)/(1-IF(Calculations!$F$17=\"\",Calculations!$D$17,Calculations!$F$17))/Conversions!$D$81","v":{"$error":"#VALUE!"}},{"$f":"I8*IF(Calculations!$F$16=\"\",Calculations!$D$16,Calculations!$F$16)/(1-IF(Calculations!$F$17=\"\",Calculations!$D$17,Calculations!$F$17))/Conversions!$D$81","v":{"$error":"#VALUE!"}},{"$f":"J8*IF(Calculations!$F$16=\"\",Calculations!$D$16,Calculations!$F$16)/(1-IF(Calculations!$F$17=\"\",Calculations!$D$17,Calculations!$F$17))/Conversions!$D$81","v":{"$error":"#VALUE!"}},{"$f":"K8*IF(Calculations!$F$16=\"\",Calculations!$D$16,Calculations!$F$16)/(1-IF(Calculations!$F$17=\"\",Calculations!$D$17,Calculations!$F$17))/Conversions!$D$81","v":{"$error":"#VALUE!"}},{"$f":"L8*IF(Calculations!$F$16=\"\",Calculations!$D$16,Calculations!$F$16)/(1-IF(Calculations!$F$17=\"\",Calculations!$D$17,Calculations!$F$17))/Conversions!$D$81","v":{"$error":"#VALUE!"}},{"$error":"#VALUE!"},null,2,{"$f":"P8*Conversions!$K$59*IF(Calculations!$F$18=\"\",Calculations!$D$18,Calculations!$F$18)/Conversions!$D$81","v":{"$error":"#VALUE!"}},{"$f":"Q8*Conversions!$K$59*IF(Calculations!$F$18=\"\",Calculations!$D$18,Calculations!$F$18)/Conversions!$D$81","v":{"$error":"#VALUE!"}},{"$f":"R8*Conversions!$K$59*IF(Calculations!$F$18=\"\",Calculations!$D$18,Calculations!$F$18)/Conversions!$D$81","v":{"$error":"#VALUE!"}},{"$f":"S8*Conversions!$K$59*IF(Calculations!$F$18=\"\",Calculations!$D$18,Calculations!$F$18)/Conversions!$D$81","v":{"$error":"#VALUE!"}},{"$f":"T8*Conversions!$K$59*IF(Calculations!$F$18=\"\",Calculations!$D$18,Calculations!$F$18)/Conversions!$D$81","v":{"$error":"#VALUE!"}},{"$f":"U8*Conversions!$K$59*IF(Calculations!$F$18=\"\",Calculations!$D$18,Calculations!$F$18)/Conversions!$D$81","v":{"$error":"#VALUE!"}},{"$f":"V8*Conversions!$K$59*IF(Calculations!$F$18=\"\",Calculations!$D$18,Calculations!$F$18)/Conversions!$D$81","v":{"$error":"#VALUE!"}},{"$f":"W8*Conversions!$K$59*IF(Calculations!$F$18=\"\",Calculations!$D$18,Calculations!$F$18)/Conversions!$D$81","v":{"$error":"#VALUE!"}},{"$f":"X8*Conversions!$K$59*IF(Calculations!$F$18=\"\",Calculations!$D$18,Calculations!$F$18)/Conversions!$D$81","v":{"$error":"#VALUE!"}},{"$f":"Y8*Conversions!$K$59*IF(Calculations!$F$18=\"\",Calculations!$D$18,Calculations!$F$18)/Conversions!$D$81","v":{"$error":"#VALUE!"}},{"$f":"SUM(P34:Y34)","v":{"$error":"#VALUE!"}},null,2,{"$error":"#VALUE!"},{"$error":"#VALUE!"},{"$error":"#VALUE!"},{"$error":"#VALUE!"},{"$error":"#VALUE!"},{"$error":"#VALUE!"},{"$error":"#VALUE!"},{"$error":"#VALUE!"},{"$error":"#VALUE!"},{"$f":"L34+Y34","v":{"$error":"#VALUE!"}},{"$f":"SUM(AC34:AL34)","v":{"$error":"#VALUE!"}},null,{"$f":"AO33+1","v":2014}]
[null,3,{"$f":"C9*IF(Calculations!$F$16=\"\",Calculations!$D$16,Calculations!$F$16)/(1-IF(Calculations!$F$17=\"\",Calculations!$D$17,Calculations!$F$17))/Conversions!$D$81","v":{"$error":"#VALUE!"}},{"$f":"D9*IF(Calculations!$F$16=\"\",Calculations!$D$16,Calculations!$F$16)/(1-IF(Calculations!$F$17=\"\",Calculations!$D$17,Calculations!$F$17))/Conversions!$D$81","v":{"$error":"#VALUE!"}},{"$f":"E9*IF(Calculations!$F$16=\"\",Calculations!$D$16,Calculations!$F$16)/(1-IF(Calculations!$F$17=\"\",Calculations!$D$17,Calculations!$F$17))/Conversions!$D$81","v":{"$error":"#VALUE!"}},{"$f":"F9*IF(Calculations!$F$16=\"\",Calculations!$D$16,Calculations!$F$16)/(1-IF(Calculations!$F$17=\"\",Calculations!$D$17,Calculations!$F$17))/Conversions!$D$81","v":{"$error":"#VALUE!"}},{"$f":"G9*IF(Calculations!$F$16=\"\",Calculations!$D$16,Calculations!$F$16)/(1-IF(Calculations!$F$17=\"\",Calculations!$D$17,Calculations!$F$17))/Conversions!$D$81","v":{"$error":"#VALUE!"}},{"$f":"H9*IF(Calculations!$F$16=\"\",Calculations!$D$16,Calculations!$F$16)/(1-IF(Calculations!$F$17=\"\",Calculations!$D$17,Calculations!$F$17))/Conversions!$D$81","v":{"$error":"#VALUE!"}},{"$f":"I9*IF(Calculations!$F$16=\"\",Calculations!$D$16,Calculations!$F$16)/(1-IF(Calculations!$F$17=\"\",Calculations!$D$17,Calculations!$F$17))/Conversions!$D$81","v":{"$error":"#VALUE!"}},{"$f":"J9*IF(Calculations!$F$16=\"\",Calculations!$D$16,Calculations!$F$16)/(1-IF(Calculations!$F$17=\"\",Calculations!$D$17,Calculations!$F$17))/Conversions!$D$81","v":{"$error":"#VALUE!"}},{"$f":"K9*IF(Calculations!$F$16=\"\",Calculations!$D$16,Calculations!$F$16)/(1-IF(Calculations!$F$17=\"\",Calculations!$D$17,Calculations!$F$17))/Conversions!$D$81","v":{"$error":"#VALUE!"}},{"$f":"L9*IF(Calculations!$F$16=\"\",Calculations!$D$16,Calculations!$F$16)/(1-IF(Calculations!$F$17=\"\",Calculations!$D$17,Calculations!$F$17))/Conversions!$D$81","v":{"$error":"#VALUE!"}},{"$error":"#VALUE!"},null,3,{"$f":"P9*Conversions!$K$59*IF(Calculations!$F$18=\"\",Calculations!$D$18,Calculations!$F$18)/Conversions!$D$81","v":{"$error":"#VALUE!"}},{"$f":"Q9*Conversions!$K$59*IF(Calculations!$F$18=\"\",Calculations!$D$18,Calculations!$F$18)/Conversions!$D$81","v":{"$error":"#VALUE!"}},{"$f":"R9*Conversions!$K$59*IF(Calculations!$F$18=\"\",Calculations!$D$18,Calculations!$F$18)/Conversions!$D$81","v":{"$error":"#VALUE!"}},{"$f":"S9*Conversions!$K$59*IF(Calculations!$F$18=\"\",Calculations!$D$18,Calculations!$F$18)/Conversions!$D$81","v":{"$error":"#VALUE!"}},{"$f":"T9*Conversions!$K$59*IF(Calculations!$F$18=\"\",Calculations!$D$18,Calculations!$F$18)/Conversions!$D$81","v":{"$error":"#VALUE!"}},{"$f":"U9*Conversions!$K$59*IF(Calculations!$F$18=\"\",Calculations!$D$18,Calculations!$F$18)/Conversions!$D$81","v":{"$error":"#VALUE!"}},{"$f":"V9*Conversions!$K$59*IF(Calculations!$F$18=\"\",Calculations!$D$18,Calculations!$F$18)/Conversions!$D$81","v":{"$error":"#VALUE!"}},{"$f":"W9*Conversions!$K$59*IF(Calculations!$F$18=\"\",Calculations!$D$18,Calculations!$F$18)/Conversions!$D$81","v":{"$error":"#VALUE!"}},{"$f":"X9*Conversions!$K$59*IF(Calculations!$F$18=\"\",Calculations!$D$18,Calculations!$F$18)/Conversions!$D$81","v":{"$error":"#VALUE!"}},{"$f":"Y9*Conversions!$K$59*IF(Calculations!$F$18=\"\",Calculations!$D$18,Calculations!$F$18)/Conversions!$D$81","v":{"$error":"#VALUE!"}},{"$error":"#VALUE!"},null,3,{"$error":"#VALUE!"},{"$error":"#VALUE!"},{"$error":"#VALUE!"},{"$error":"#VALUE!"},{"$error":"#VALUE!"},{"$error":"#VALUE!"},{"$error":"#VALUE!"},{"$error":"#VALUE!"},{"$error":"#VALUE!"},{"$error":"#VALUE!"},{"$error":"#VALUE!"},null,{"$f":"AO34+1","v":2015}]
[null,4,{"$f":"C10*IF(Calculations!$F$16=\"\",Calculations!$D$16,Calculations!$F$16)/(1-IF(Calculations!$F$17=\"\",Calculations!$D$17,Calculations!$F$17))/Conversions!$D$81","v":{"$error":"#VALUE!"}},{"$f":"D10*IF(Calculations!$F$16=\"\",Calculations!$D$16,Calculations!$F$16)/(1-IF(Calculations!$F$17=\"\",Calculations!$D$17,Calculations!$F$17))/Conversions!$D$81","v":{"$error":"#VALUE!"}},{"$f":"E10*IF(Calculations!$F$16=\"\",Calculations!$D$16,Calculations!$F$16)/(1-IF(Calculations!$F$17=\"\",Calculations!$D$17,Calculations!$F$17))/Conversions!$D$81","v":{"$error":"#VALUE!"}},{"$f":"F10*IF(Calculations!$F$16=\"\",Calculations!$D$16,Calculations!$F$16)/(1-IF(Calculations!$F$17=\"\",Calculations!$D$17,Calculations!$F$17))/Conversions!$D$81","v":{"$error":"#VALUE!"}},{"$f":"G10*IF(Calculations!$F$16=\"\",Calculations!$D$16,Calculations!$F$16)/(1-IF(Calculations!$F$17=\"\",Calculations!$D$17,Calculations!$F$17))/Conversions!$D$81","v":{"$error":"#VALUE!"}},{"$f":"H10*IF(Calculations!$F$16=\"\",Calculations!$D$16,Calculations!$F$16)/(1-IF(Calculations!$F$17=\"\",Calculations!$D$17,Calculations!$F$17))/Conversions!$D$81","v":{"$error":"#VALUE!"}},{"$f":"I10*IF(Calculations!$F$16=\"\",Calculations!$D$16,Calculations!$F$16)/(1-IF(Calculations!$F$17=\"\",Calculations!$D$17,Calculations!$F$17))/Conversions!$D$81","v":{"$error":"#VALUE!"}},{"$f":"J10*IF(Calculations!$F$16=\"\",Calculations!$D$16,Calculations!$F$16)/(1-IF(Calculations!$F$17=\"\",Calculations!$D$17,Calculations!$F$17))/Conversions!$D$81","v":{"$error":"#VALUE!"}},{"$f":"K10*IF(Calculations!$F$16=\"\",Calculations!$D$16,Calculations!$F$16)/(1-IF(Calculations!$F$17=\"\",Calculations!$D$17,Calculations!$F$17))/Conversions!$D$81","v":{"$error":"#VALUE!"}},{"$f":"L10*IF(Calculations!$F$16=\"\",Calculations!$D$16,Calculations!$F$16)/(1-IF(Calculations!$F$17=\"\",Calculations!$D$17,Calculations!$F$17))/Conversions!$D$81","v":{"$error":"#VALUE!"}},{"$error":"#VALUE!"},null,4,{"$f":"P10*Conversions!$K$59*IF(Calculations!$F$18=\"\",Calculations!$D$18,Calculations!$F$18)/Conversions!$D$81","v":{"$error":"#VALUE!"}},{"$f":"Q10*Conversions!$K$59*IF(Calculations!$F$18=\"\",Calculations!$D$18,Calculations!$F$18)/Conversions!$D$81","v":{"$error":"#VALUE!"}},{"$f":"R10*Conversions!$K$59*IF(Calculations!$F$18=\"\",Calculations!$D$18,Calculations!$F$18)/Conversions!$D$81","v":{"$error":"#VALUE!"}},{"$f":"S10*Conversions!$K$59*IF(Calculations!$F$18=\"\",Calculations!$D$18,Calculations!$F$18)/Conversions!$D$81","v":{"$error":"#VALUE!"}},{"$f":"T10*Conversions!$K$59*IF(Calculations!$F$18=\"\",Calculations!$D$18,Calculations!$F$18)/Conversions!$D$81","v":{"$error":"#VALUE!"}},{"$f":"U10*Conversions!$K$59*IF(Calculations!$F$18=\"\",Calculations!$D$18,Calculations!$F$18)/Conversions!$D$81","v":{"$error":"#VALUE!"}},{"$f":"V10*Conversions!$K$59*IF(Calculations!$F$18=\"\",Calculations!$D$18,Calculations!$F$18)/Conversions!$D$81","v":{"$error":"#VALUE!"}},{"$f":"W10*Conversions!$K$59*IF(Calculations!$F$18=\"\",Calculations!$D$18,Calculations!$F$18)/Conversions!$D$81","v":{"$error":"#VALUE!"}},{"$f":"X10*Conversions!$K$59*IF(Calculations!$F$18=\"\",Calculations!$D$18,Calculations!$F$18)/Conversions!$D$81","v":{"$error":"#VALUE!"}},{"$f":"Y10*Conversions!$K$59*IF(Calculations!$F$18=\"\",Calculations!$D$18,Calculations!$F$18)/Conversions!$D$81","v":{"$error":"#VALUE!"}},{"$error":"#VALUE!"},null,4,{"$error":"#VALUE!"},{"$error":"#VALUE!"},{"$error":"#VALUE!"},{"$error":"#VALUE!"},{"$error":"#VALUE!"},{"$error":"#VALUE!"},{"$error":"#VALUE!"},{"$error":"#VALUE!"},{"$error":"#VALUE!"},{"$error":"#VALUE!"},{"$error":"#VALUE!"},null,2016]
[null,5,{"$f":"C11*IF(Calculations!$F$16=\"\",Calculations!$D$16,Calculations!$F$16)/(1-IF(Calculations!$F$17=\"\",Calculations!$D$17,Calculations!$F$17))/Conversions!$D$81","v":{"$error":"#VALUE!"}},{"$f":"D11*IF(Calculations!$F$16=\"\",Calculations!$D$16,Calculations!$F$16)/(1-IF(Calculations!$F$17=\"\",Calculations!$D$17,Calculations!$F$17))/Conversions!$D$81","v":{"$error":"#VALUE!"}},{"$f":"E11*IF(Calculations!$F$16=\"\",Calculations!$D$16,Calculations!$F$16)/(1-IF(Calculations!$F$17=\"\",Calculations!$D$17,Calculations!$F$17))/Conversions!$D$81","v":{"$error":"#VALUE!"}},{"$f":"F11*IF(Calculations!$F$16=\"\",Calculations!$D$16,Calculations!$F$16)/(1-IF(Calculations!$F$17=\"\",Calculations!$D$17,Calculations!$F$17))/Conversions!$D$81","v":{"$error":"#VALUE!"}},{"$f":"G11*IF(Calculations!$F$16=\"\",Calculations!$D$16,Calculations!$F$16)/(1-IF(Calculations!$F$17=\"\",Calculations!$D$17,Calculations!$F$17))/Conversions!$D$81","v":{"$error":"#VALUE!"}},{"$f":"H11*IF(Calculations!$F$16=\"\",Calculations!$D$16,Calculations!$F$16)/(1-IF(Calculations!$F$17=\"\",Calculations!$D$17,Calculations!$F$17))/Conversions!$D$81","v":{"$error":"#VALUE!"}},{"$f":"I11*IF(Calculations!$F$16=\"\",Calculations!$D$16,Calculations!$F$16)/(1-IF(Calculations!$F$17=\"\",Calculations!$D$17,Calculations!$F$17))/Conversions!$D$81","v":{"$error":"#VALUE!"}},{"$f":"J11*IF(Calculations!$F$16=\"\",Calculations!$D$16,Calculations!$F$16)/(1-IF(Calculations!$F$17=\"\",Calculations!$D$17,Calculations!$F$17))/Conversions!$D$81","v":{"$error":"#VALUE!"}},{"$f":"K11*IF(Calculations!$F$16=\"\",Calculations!$D$16,Calculations!$F$16)/(1-IF(Calculations!$F$17=\"\",Calculations!$D$17,Calculations!$F$17))/Conversions!$D$81","v":{"$error":"#VALUE!"}},{"$f":"L11*IF(Calculations!$F$16=\"\",Calculations!$D$16,Calculations!$F$16)/(1-IF(Calculations!$F$17=\"\",Calculations!$D$17,Calculations!$F$17))/Conversions!$D$81","v":{"$error":"#VALUE!"}},{"$error":"#VALUE!"},null,5,{"$f":"P11*Conversions!$K$59*IF(Calculations!$F$18=\"\",Calculations!$D$18,Calculations!$F$18)/Conversions!$D$81","v":{"$error":"#VALUE!"}},{"$f":"Q11*Conversions!$K$59*IF(Calculations!$F$18=\"\",Calculations!$D$18,Calculations!$F$18)/Conversions!$D$81","v":{"$error":"#VALUE!"}},{"$f":"R11*Conversions!$K$59*IF(Calculations!$F$18=\"\",Calculations!$D$18,Calculations!$F$18)/Conversions!$D$81","v":{"$error":"#VALUE!"}},{"$f":"S11*Conversions!$K$59*IF(Calculations!$F$18=\"\",Calculations!$D$18,Calculations!$F$18)/Conversions!$D$81","v":{"$error":"#VALUE!"}},{"$f":"T11*Conversions!$K$59*IF(Calculations!$F$18=\"\",Calculations!$D$18,Calculations!$F$18)/Conversions!$D$81","v":{"$error":"#VALUE!"}},{"$f":"U11*Conversions!$K$59*IF(Calculations!$F$18=\"\",Calculations!$D$18,Calculations!$F$18)/Conversions!$D$81","v":{"$error":"#VALUE!"}},{"$f":"V11*Conversions!$K$59*IF(Calculations!$F$18=\"\",Calculations!$D$18,Calculations!$F$18)/Conversions!$D$81","v":{"$error":"#VALUE!"}},{"$f":"W11*Conversions!$K$59*IF(Calculations!$F$18=\"\",Calculations!$D$18,Calculations!$F$18)/Conversions!$D$81","v":{"$error":"#VALUE!"}},{"$f":"X11*Conversions!$K$59*IF(Calculations!$F$18=\"\",Calculations!$D$18,Calculations!$F$18)/Conversions!$D$81","v":{"$error":"#VALUE!"}},{"$f":"Y11*Conversions!$K$59*IF(Calculations!$F$18=\"\",Calculations!$D$18,Calculations!$F$18)/Conversions!$D$81","v":{"$error":"#VALUE!"}},{"$error":"#VALUE!"},null,5,{"$error":"#VALUE!"},{"$error":"#VALUE!"},{"$error":"#VALUE!"},{"$error":"#VALUE!"},{"$error":"#VALUE!"},{"$error":"#VALUE!"},{"$error":"#VALUE!"},{"$error":"#VALUE!"},{"$error":"#VALUE!"},{"$error":"#VALUE!"},{"$error":"#VALUE!"},null,2017]
[null,6,{"$f":"C12*IF(Calculations!$F$16=\"\",Calculations!$D$16,Calculations!$F$16)/(1-IF(Calculations!$F$17=\"\",Calculations!$D$17,Calculations!$F$17))/Conversions!$D$81","v":{"$error":"#VALUE!"}},{"$f":"D12*IF(Calculations!$F$16=\"\",Calculations!$D$16,Calculations!$F$16)/(1-IF(Calculations!$F$17=\"\",Calculations!$D$17,Calculations!$F$17))/Conversions!$D$81","v":{"$error":"#VALUE!"}},{"$f":"E12*IF(Calculations!$F$16=\"\",Calculations!$D$16,Calculations!$F$16)/(1-IF(Calculations!$F$17=\"\",Calculations!$D$17,Calculations!$F$17))/Conversions!$D$81","v":{"$error":"#VALUE!"}},{"$f":"F12*IF(Calculations!$F$16=\"\",Calculations!$D$16,Calculations!$F$16)/(1-IF(Calculations!$F$17=\"\",Calculations!$D$17,Calculations!$F$17))/Conversions!$D$81","v":{"$error":"#VALUE!"}},{"$f":"G12*IF(Calculations!$F$16=\"\",Calculations!$D$16,Calculations!$F$16)/(1-IF(Calculations!$F$17=\"\",Calculations!$D$17,Calculations!$F$17))/Conversions!$D$81","v":{"$error":"#VALUE!"}},{"$f":"H12*IF(Calculations!$F$16=\"\",Calculations!$D$16,Calculations!$F$16)/(1-IF(Calculations!$F$17=\"\",Calculations!$D$17,Calculations!$F$17))/Conversions!$D$81","v":{"$error":"#VALUE!"}},{"$f":"I12*IF(Calculations!$F$16=\"\",Calculations!$D$16,Calculations!$F$16)/(1-IF(Calculations!$F$17=\"\",Calculations!$D$17,Calculations!$F$17))/Conversions!$D$81","v":{"$error":"#VALUE!"}},{"$f":"J12*IF(Calculations!$F$16=\"\",Calculations!$D$16,Calculations!$F$16)/(1-IF(Calculations!$F$17=\"\",Calculations!$D$17,Calculations!$F$17))/Conversions!$D$81","v":{"$error":"#VALUE!"}},{"$f":"K12*IF(Calculations!$F$16=\"\",Calculations!$D$16,Calculations!$F$16)/(1-IF(Calculations!$F$17=\"\",Calculations!$D$17,Calculations!$F$17))/Conversions!$D$81","v":{"$error":"#VALUE!"}},{"$f":"L12*IF(Calculations!$F$16=\"\",Calculations!$D$16,Calculations!$F$16)/(1-IF(Calculations!$F$17=\"\",Calculations!$D$17,Calculations!$F$17))/Conversions!$D$81","v":{"$error":"#VALUE!"}},{"$error":"#VALUE!"},null,6,{"$f":"P12*Conversions!$K$59*IF(Calculations!$F$18=\"\",Calculations!$D$18,Calculations!$F$18)/Conversions!$D$81","v":{"$error":"#VALUE!"}},{"$f":"Q12*Conversions!$K$59*IF(Calculations!$F$18=\"\",Calculations!$D$18,Calculations!$F$18)/Conversions!$D$81","v":{"$error":"#VALUE!"}},{"$f":"R12*Conversions!$K$59*IF(Calculations!$F$18=\"\",Calculations!$D$18,Calculations!$F$18)/Conversions!$D$81","v":{"$error":"#VALUE!"}},{"$f":"S12*Conversions!$K$59*IF(Calculations!$F$18=\"\",Calculations!$D$18,Calculations!$F$18)/Conversions!$D$81","v":{"$error":"#VALUE!"}},{"$f":"T12*Conversions!$K$59*IF(Calculations!$F$18=\"\",Calculations!$D$18,Calculations!$F$18)/Conversions!$D$81","v":{"$error":"#VALUE!"}},{"$f":"U12*Conversions!$K$59*IF(Calculations!$F$18=\"\",Calculations!$D$18,Calculations!$F$18)/Conversions!$D$81","v":{"$error":"#VALUE!"}},{"$f":"V12*Conversions!$K$59*IF(Calculations!$F$18=\"\",Calculations!$D$18,Calculations!$F$18)/Conversions!$D$81","v":{"$error":"#VALUE!"}},{"$f":"W12*Conversions!$K$59*IF(Calculations!$F$18=\"\",Calculations!$D$18,Calculations!$F$18)/Conversions!$D$81","v":{"$error":"#VALUE!"}},{"$f":"X12*Conversions!$K$59*IF(Calculations!$F$18=\"\",Calculations!$D$18,Calculations!$F$18)/Conversions!$D$81","v":{"$error":"#VALUE!"}},{"$f":"Y12*Conversions!$K$59*IF(Calculations!$F$18=\"\",Calculations!$D$18,Calculations!$F$18)/Conversions!$D$81","v":{"$error":"#VALUE!"}},{"$error":"#VALUE!"},null,6,{"$error":"#VALUE!"},{"$error":"#VALUE!"},{"$error":"#VALUE!"},{"$error":"#VALUE!"},{"$error":"#VALUE!"},{"$error":"#VALUE!"},{"$error":"#VALUE!"},{"$error":"#VALUE!"},{"$error":"#VALUE!"},{"$error":"#VALUE!"},{"$error":"#VALUE!"},null,2018]
[null,7,{"$f":"C13*IF(Calculations!$F$16=\"\",Calculations!$D$16,Calculations!$F$16)/(1-IF(Calculations!$F$17=\"\",Calculations!$D$17,Calculations!$F$17))/Conversions!$D$81","v":{"$error":"#VALUE!"}},{"$f":"D13*IF(Calculations!$F$16=\"\",Calculations!$D$16,Calculations!$F$16)/(1-IF(Calculations!$F$17=\"\",Calculations!$D$17,Calculations!$F$17))/Conversions!$D$81","v":{"$error":"#VALUE!"}},{"$f":"E13*IF(Calculations!$F$16=\"\",Calculations!$D$16,Calculations!$F$16)/(1-IF(Calculations!$F$17=\"\",Calculations!$D$17,Calculations!$F$17))/Conversions!$D$81","v":{"$error":"#VALUE!"}},{"$f":"F13*IF(Calculations!$F$16=\"\",Calculations!$D$16,Calculations!$F$16)/(1-IF(Calculations!$F$17=\"\",Calculations!$D$17,Calculations!$F$17))/Conversions!$D$81","v":{"$error":"#VALUE!"}},{"$f":"G13*IF(Calculations!$F$16=\"\",Calculations!$D$16,Calculations!$F$16)/(1-IF(Calculations!$F$17=\"\",Calculations!$D$17,Calculations!$F$17))/Conversions!$D$81","v":{"$error":"#VALUE!"}},{"$f":"H13*IF(Calculations!$F$16=\"\",Calculations!$D$16,Calculations!$F$16)/(1-IF(Calculations!$F$17=\"\",Calculations!$D$17,Calculations!$F$17))/Conversions!$D$81","v":{"$error":"#VALUE!"}},{"$f":"I13*IF(Calculations!$F$16=\"\",Calculations!$D$16,Calculations!$F$16)/(1-IF(Calculations!$F$17=\"\",Calculations!$D$17,Calculations!$F$17))/Conversions!$D$81","v":{"$error":"#VALUE!"}},{"$f":"J13*IF(Calculations!$F$16=\"\",Calculations!$D$16,Calculations!$F$16)/(1-IF(Calculations!$F$17=\"\",Calculations!$D$17,Calculations!$F$17))/Conversions!$D$81","v":{"$error":"#VALUE!"}},{"$f":"K13*IF(Calculations!$F$16=\"\",Calculations!$D$16,Calculations!$F$16)/(1-IF(Calculations!$F$17=\"\",Calculations!$D$17,Calculations!$F$17))/Conversions!$D$81","v":{"$error":"#VALUE!"}},{"$f":"L13*IF(Calculations!$F$16=\"\",Calculations!$D$16,Calculations!$F$16)/(1-IF(Calculations!$F$17=\"\",Calculations!$D$17,Calculations!$F$17))/Conversions!$D$81","v":{"$error":"#VALUE!"}},{"$error":"#VALUE!"},null,7,{"$f":"P13*Conversions!$K$59*IF(Calculations!$F$18=\"\",Calculations!$D$18,Calculations!$F$18)/Conversions!$D$81","v":{"$error":"#VALUE!"}},{"$f":"Q13*Conversions!$K$59*IF(Calculations!$F$18=\"\",Calculations!$D$18,Calculations!$F$18)/Conversions!$D$81","v":{"$error":"#VALUE!"}},{"$f":"R13*Conversions!$K$59*IF(Calculations!$F$18=\"\",Calculations!$D$18,Calculations!$F$18)/Conversions!$D$81","v":{"$error":"#VALUE!"}},{"$f":"S13*Conversions!$K$59*IF(Calculations!$F$18=\"\",Calculations!$D$18,Calculations!$F$18)/Conversions!$D$81","v":{"$error":"#VALUE!"}},{"$f":"T13*Conversions!$K$59*IF(Calculations!$F$18=\"\",Calculations!$D$18,Calculations!$F$18)/Conversions!$D$81","v":{"$error":"#VALUE!"}},{"$f":"U13*Conversions!$K$59*IF(Calculations!$F$18=\"\",Calculations!$D$18,Calculations!$F$18)/Conversions!$D$81","v":{"$error":"#VALUE!"}},{"$f":"V13*Conversions!$K$59*IF(Calculations!$F$18=\"\",Calculations!$D$18,Calculations!$F$18)/Conversions!$D$81","v":{"$error":"#VALUE!"}},{"$f":"W13*Conversions!$K$59*IF(Calculations!$F$18=\"\",Calculations!$D$18,Calculations!$F$18)/Conversions!$D$81","v":{"$error":"#VALUE!"}},{"$f":"X13*Conversions!$K$59*IF(Calculations!$F$18=\"\",Calculations!$D$18,Calculations!$F$18)/Conversions!$D$81","v":{"$error":"#VALUE!"}},{"$f":"Y13*Conversions!$K$59*IF(Calculations!$F$18=\"\",Calculations!$D$18,Calculations!$F$18)/Conversions!$D$81","v":{"$error":"#VALUE!"}},{"$error":"#VALUE!"},null,7,{"$error":"#VALUE!"},{"$error":"#VALUE!"},{"$error":"#VALUE!"},{"$error":"#VALUE!"},{"$error":"#VALUE!"},{"$error":"#VALUE!"},{"$error":"#VALUE!"},{"$error":"#VALUE!"},{"$error":"#VALUE!"},{"$error":"#VALUE!"},{"$error":"#VALUE!"},null,2019]
[null,8,{"$f":"C14*IF(Calculations!$F$16=\"\",Calculations!$D$16,Calculations!$F$16)/(1-IF(Calculations!$F$17=\"\",Calculations!$D$17,Calculations!$F$17))/Conversions!$D$81","v":{"$error":"#VALUE!"}},{"$f":"D14*IF(Calculations!$F$16=\"\",Calculations!$D$16,Calculations!$F$16)/(1-IF(Calculations!$F$17=\"\",Calculations!$D$17,Calculations!$F$17))/Conversions!$D$81","v":{"$error":"#VALUE!"}},{"$f":"E14*IF(Calculations!$F$16=\"\",Calculations!$D$16,Calculations!$F$16)/(1-IF(Calculations!$F$17=\"\",Calculations!$D$17,Calculations!$F$17))/Conversions!$D$81","v":{"$error":"#VALUE!"}},{"$f":"F14*IF(Calculations!$F$16=\"\",Calculations!$D$16,Calculations!$F$16)/(1-IF(Calculations!$F$17=\"\",Calculations!$D$17,Calculations!$F$17))/Conversions!$D$81","v":{"$error":"#VALUE!"}},{"$f":"G14*IF(Calculations!$F$16=\"\",Calculations!$D$16,Calculations!$F$16)/(1-IF(Calculations!$F$17=\"\",Calculations!$D$17,Calculations!$F$17))/Conversions!$D$81","v":{"$error":"#VALUE!"}},{"$f":"H14*IF(Calculations!$F$16=\"\",Calculations!$D$16,Calculations!$F$16)/(1-IF(Calculations!$F$17=\"\",Calculations!$D$17,Calculations!$F$17))/Conversions!$D$81","v":{"$error":"#VALUE!"}},{"$f":"I14*IF(Calculations!$F$16=\"\",Calculations!$D$16,Calculations!$F$16)/(1-IF(Calculations!$F$17=\"\",Calculations!$D$17,Calculations!$F$17))/Conversions!$D$81","v":{"$error":"#VALUE!"}},{"$f":"J14*IF(Calculations!$F$16=\"\",Calculations!$D$16,Calculations!$F$16)/(1-IF(Calculations!$F$17=\"\",Calculations!$D$17,Calculations!$F$17))/Conversions!$D$81","v":{"$error":"#VALUE!"}},{"$f":"K14*IF(Calculations!$F$16=\"\",Calculations!$D$16,Calculations!$F$16)/(1-IF(Calculations!$F$17=\"\",Calculations!$D$17,Calculations!$F$17))/Conversions!$D$81","v":{"$error":"#VALUE!"}},{"$f":"L14*IF(Calculations!$F$16=\"\",Calculations!$D$16,Calculations!$F$16)/(1-IF(Calculations!$F$17=\"\",Calculations!$D$17,Calculations!$F$17))/Conversions!$D$81","v":{"$error":"#VALUE!"}},{"$error":"#VALUE!"},null,8,{"$f":"P14*Conversions!$K$59*IF(Calculations!$F$18=\"\",Calculations!$D$18,Calculations!$F$18)/Conversions!$D$81","v":{"$error":"#VALUE!"}},{"$f":"Q14*Conversions!$K$59*IF(Calculations!$F$18=\"\",Calculations!$D$18,Calculations!$F$18)/Conversions!$D$81","v":{"$error":"#VALUE!"}},{"$f":"R14*Conversions!$K$59*IF(Calculations!$F$18=\"\",Calculations!$D$18,Calculations!$F$18)/Conversions!$D$81","v":{"$error":"#VALUE!"}},{"$f":"S14*Conversions!$K$59*IF(Calculations!$F$18=\"\",Calculations!$D$18,Calculations!$F$18)/Conversions!$D$81","v":{"$error":"#VALUE!"}},{"$f":"T14*Conversions!$K$59*IF(Calculations!$F$18=\"\",Calculations!$D$18,Calculations!$F$18)/Conversions!$D$81","v":{"$error":"#VALUE!"}},{"$f":"U14*Conversions!$K$59*IF(Calculations!$F$18=\"\",Calculations!$D$18,Calculations!$F$18)/Conversions!$D$81","v":{"$error":"#VALUE!"}},{"$f":"V14*Conversions!$K$59*IF(Calculations!$F$18=\"\",Calculations!$D$18,Calculations!$F$18)/Conversions!$D$81","v":{"$error":"#VALUE!"}},{"$f":"W14*Conversions!$K$59*IF(Calculations!$F$18=\"\",Calculations!$D$18,Calculations!$F$18)/Conversions!$D$81","v":{"$error":"#VALUE!"}},{"$f":"X14*Conversions!$K$59*IF(Calculations!$F$18=\"\",Calculations!$D$18,Calculations!$F$18)/Conversions!$D$81","v":{"$error":"#VALUE!"}},{"$f":"Y14*Conversions!$K$59*IF(Calculations!$F$18=\"\",Calculations!$D$18,Calculations!$F$18)/Conversions!$D$81","v":{"$error":"#VALUE!"}},{"$error":"#VALUE!"},null,8,{"$error":"#VALUE!"},{"$error":"#VALUE!"},{"$error":"#VALUE!"},{"$error":"#VALUE!"},{"$error":"#VALUE!"},{"$error":"#VALUE!"},{"$error":"#VALUE!"},{"$error":"#VALUE!"},{"$error":"#VALUE!"},{"$error":"#VALUE!"},{"$error":"#VALUE!"},null,2020]
[null,9,{"$f":"C15*IF(Calculations!$F$16=\"\",Calculations!$D$16,Calculations!$F$16)/(1-IF(Calculations!$F$17=\"\",Calculations!$D$17,Calculations!$F$17))/Conversions!$D$81","v":{"$error":"#VALUE!"}},{"$f":"D15*IF(Calculations!$F$16=\"\",Calculations!$D$16,Calculations!$F$16)/(1-IF(Calculations!$F$17=\"\",Calculations!$D$17,Calculations!$F$17))/Conversions!$D$81","v":{"$error":"#VALUE!"}},{"$f":"E15*IF(Calculations!$F$16=\"\",Calculations!$D$16,Calculations!$F$16)/(1-IF(Calculations!$F$17=\"\",Calculations!$D$17,Calculations!$F$17))/Conversions!$D$81","v":{"$error":"#VALUE!"}},{"$f":"F15*IF(Calculations!$F$16=\"\",Calculations!$D$16,Calculations!$F$16)/(1-IF(Calculations!$F$17=\"\",Calculations!$D$17,Calculations!$F$17))/Conversions!$D$81","v":{"$error":"#VALUE!"}},{"$f":"G15*IF(Calculations!$F$16=\"\",Calculations!$D$16,Calculations!$F$16)/(1-IF(Calculations!$F$17=\"\",Calculations!$D$17,Calculations!$F$17))/Conversions!$D$81","v":{"$error":"#VALUE!"}},{"$f":"H15*IF(Calculations!$F$16=\"\",Calculations!$D$16,Calculations!$F$16)/(1-IF(Calculations!$F$17=\"\",Calculations!$D$17,Calculations!$F$17))/Conversions!$D$81","v":{"$error":"#VALUE!"}},{"$f":"I15*IF(Calculations!$F$16=\"\",Calculations!$D$16,Calculations!$F$16)/(1-IF(Calculations!$F$17=\"\",Calculations!$D$17,Calculations!$F$17))/Conversions!$D$81","v":{"$error":"#VALUE!"}},{"$f":"J15*IF(Calculations!$F$16=\"\",Calculations!$D$16,Calculations!$F$16)/(1-IF(Calculations!$F$17=\"\",Calculations!$D$17,Calculations!$F$17))/Conversions!$D$81","v":{"$error":"#VALUE!"}},{"$f":"K15*IF(Calculations!$F$16=\"\",Calculations!$D$16,Calculations!$F$16)/(1-IF(Calculations!$F$17=\"\",Calculations!$D$17,Calculations!$F$17))/Conversions!$D$81","v":{"$error":"#VALUE!"}},{"$f":"L15*IF(Calculations!$F$16=\"\",Calculations!$D$16,Calculations!$F$16)/(1-IF(Calculations!$F$17=\"\",Calculations!$D$17,Calculations!$F$17))/Conversions!$D$81","v":{"$error":"#VALUE!"}},{"$error":"#VALUE!"},null,9,{"$f":"P15*Conversions!$K$59*IF(Calculations!$F$18=\"\",Calculations!$D$18,Calculations!$F$18)/Conversions!$D$81","v":{"$error":"#VALUE!"}},{"$f":"Q15*Conversions!$K$59*IF(Calculations!$F$18=\"\",Calculations!$D$18,Calculations!$F$18)/Conversions!$D$81","v":{"$error":"#VALUE!"}},{"$f":"R15*Conversions!$K$59*IF(Calculations!$F$18=\"\",Calculations!$D$18,Calculations!$F$18)/Conversions!$D$81","v":{"$error":"#VALUE!"}},{"$f":"S15*Conversions!$K$59*IF(Calculations!$F$18=\"\",Calculations!$D$18,Calculations!$F$18)/Conversions!$D$81","v":{"$error":"#VALUE!"}},{"$f":"T15*Conversions!$K$59*IF(Calculations!$F$18=\"\",Calculations!$D$18,Calculations!$F$18)/Conversions!$D$81","v":{"$error":"#VALUE!"}},{"$f":"U15*Conversions!$K$59*IF(Calculations!$F$18=\"\",Calculations!$D$18,Calculations!$F$18)/Conversions!$D$81","v":{"$error":"#VALUE!"}},{"$f":"V15*Conversions!$K$59*IF(Calculations!$F$18=\"\",Calculations!$D$18,Calculations!$F$18)/Conversions!$D$81","v":{"$error":"#VALUE!"}},{"$f":"W15*Conversions!$K$59*IF(Calculations!$F$18=\"\",Calculations!$D$18,Calculations!$F$18)/Conversions!$D$81","v":{"$error":"#VALUE!"}},{"$f":"X15*Conversions!$K$59*IF(Calculations!$F$18=\"\",Calculations!$D$18,Calculations!$F$18)/Conversions!$D$81","v":{"$error":"#VALUE!"}},{"$f":"Y15*Conversions!$K$59*IF(Calculations!$F$18=\"\",Calculations!$D$18,Calculations!$F$18)/Conversions!$D$81","v":{"$error":"#VALUE!"}},{"$error":"#VALUE!"},null,9,{"$error":"#VALUE!"},{"$error":"#VALUE!"},{"$error":"#VALUE!"},{"$error":"#VALUE!"},{"$error":"#VALUE!"},{"$error":"#VALUE!"},{"$error":"#VALUE!"},{"$error":"#VALUE!"},{"$error":"#VALUE!"},{"$error":"#VALUE!"},{"$error":"#VALUE!"},null,2021]
[null,10,{"$f":"C16*IF(Calculations!$F$16=\"\",Calculations!$D$16,Calculations!$F$16)/(1-IF(Calculations!$F$17=\"\",Calculations!$D$17,Calculations!$F$17))/Conversions!$D$81","v":{"$error":"#VALUE!"}},{"$f":"D16*IF(Calculations!$F$16=\"\",Calculations!$D$16,Calculations!$F$16)/(1-IF(Calculations!$F$17=\"\",Calculations!$D$17,Calculations!$F$17))/Conversions!$D$81","v":{"$error":"#VALUE!"}},{"$f":"E16*IF(Calculations!$F$16=\"\",Calculations!$D$16,Calculations!$F$16)/(1-IF(Calculations!$F$17=\"\",Calculations!$D$17,Calculations!$F$17))/Conversions!$D$81","v":{"$error":"#VALUE!"}},{"$f":"F16*IF(Calculations!$F$16=\"\",Calculations!$D$16,Calculations!$F$16)/(1-IF(Calculations!$F$17=\"\",Calculations!$D$17,Calculations!$F$17))/Conversions!$D$81","v":{"$error":"#VALUE!"}},{"$f":"G16*IF(Calculations!$F$16=\"\",Calculations!$D$16,Calculations!$F$16)/(1-IF(Calculations!$F$17=\"\",Calculations!$D$17,Calculations!$F$17))/Conversions!$D$81","v":{"$error":"#VALUE!"}},{"$f":"H16*IF(Calculations!$F$16=\"\",Calculations!$D$16,Calculations!$F$16)/(1-IF(Calculations!$F$17=\"\",Calculations!$D$17,Calculations!$F$17))/Conversions!$D$81","v":{"$error":"#VALUE!"}},{"$f":"I16*IF(Calculations!$F$16=\"\",Calculations!$D$16,Calculations!$F$16)/(1-IF(Calculations!$F$17=\"\",Calculations!$D$17,Calculations!$F$17))/Conversions!$D$81","v":{"$error":"#VALUE!"}},{"$f":"J16*IF(Calculations!$F$16=\"\",Calculations!$D$16,Calculations!$F$16)/(1-IF(Calculations!$F$17=\"\",Calculations!$D$17,Calculations!$F$17))/Conversions!$D$81","v":{"$error":"#VALUE!"}},{"$f":"K16*IF(Calculations!$F$16=\"\",Calculations!$D$16,Calculations!$F$16)/(1-IF(Calculations!$F$17=\"\",Calculations!$D$17,Calculations!$F$17))/Conversions!$D$81","v":{"$error":"#VALUE!"}},{"$f":"L16*IF(Calculations!$F$16=\"\",Calculations!$D$16,Calculations!$F$16)/(1-IF(Calculations!$F$17=\"\",Calculations!$D$17,Calculations!$F$17))/Conversions!$D$81","v":{"$error":"#VALUE!"}},{"$error":"#VALUE!"},null,10,{"$f":"P16*Conversions!$K$59*IF(Calculations!$F$18=\"\",Calculations!$D$18,Calculations!$F$18)/Conversions!$D$81","v":{"$error":"#VALUE!"}},{"$f":"Q16*Conversions!$K$59*IF(Calculations!$F$18=\"\",Calculations!$D$18,Calculations!$F$18)/Conversions!$D$81","v":{"$error":"#VALUE!"}},{"$f":"R16*Conversions!$K$59*IF(Calculations!$F$18=\"\",Calculations!$D$18,Calculations!$F$18)/Conversions!$D$81","v":{"$error":"#VALUE!"}},{"$f":"S16*Conversions!$K$59*IF(Calculations!$F$18=\"\",Calculations!$D$18,Calculations!$F$18)/Conversions!$D$81","v":{"$error":"#VALUE!"}},{"$f":"T16*Conversions!$K$59*IF(Calculations!$F$18=\"\",Calculations!$D$18,Calculations!$F$18)/Conversions!$D$81","v":{"$error":"#VALUE!"}},{"$f":"U16*Conversions!$K$59*IF(Calculations!$F$18=\"\",Calculations!$D$18,Calculations!$F$18)/Conversions!$D$81","v":{"$error":"#VALUE!"}},{"$f":"V16*Conversions!$K$59*IF(Calculations!$F$18=\"\",Calculations!$D$18,Calculations!$F$18)/Conversions!$D$81","v":{"$error":"#VALUE!"}},{"$f":"W16*Conversions!$K$59*IF(Calculations!$F$18=\"\",Calculations!$D$18,Calculations!$F$18)/Conversions!$D$81","v":{"$error":"#VALUE!"}},{"$f":"X16*Conversions!$K$59*IF(Calculations!$F$18=\"\",Calculations!$D$18,Calculations!$F$18)/Conversions!$D$81","v":{"$error":"#VALUE!"}},{"$f":"Y16*Conversions!$K$59*IF(Calculations!$F$18=\"\",Calculations!$D$18,Calculations!$F$18)/Conversions!$D$81","v":{"$error":"#VALUE!"}},{"$error":"#VALUE!"},null,10,{"$error":"#VALUE!"},{"$error":"#VALUE!"},{"$error":"#VALUE!"},{"$error":"#VALUE!"},{"$error":"#VALUE!"},{"$error":"#VALUE!"},{"$error":"#VALUE!"},{"$error":"#VALUE!"},{"$error":"#VALUE!"},{"$error":"#VALUE!"},{"$error":"#VALUE!"},null,2022]
[null,11,{"$f":"C17*IF(Calculations!$F$16=\"\",Calculations!$D$16,Calculations!$F$16)/(1-IF(Calculations!$F$17=\"\",Calculations!$D$17,Calculations!$F$17))/Conversions!$D$81","v":{"$error":"#VALUE!"}},{"$f":"D17*IF(Calculations!$F$16=\"\",Calculations!$D$16,Calculations!$F$16)/(1-IF(Calculations!$F$17=\"\",Calculations!$D$17,Calculations!$F$17))/Conversions!$D$81","v":{"$error":"#VALUE!"}},{"$f":"E17*IF(Calculations!$F$16=\"\",Calculations!$D$16,Calculations!$F$16)/(1-IF(Calculations!$F$17=\"\",Calculations!$D$17,Calculations!$F$17))/Conversions!$D$81","v":{"$error":"#VALUE!"}},{"$f":"F17*IF(Calculations!$F$16=\"\",Calculations!$D$16,Calculations!$F$16)/(1-IF(Calculations!$F$17=\"\",Calculations!$D$17,Calculations!$F$17))/Conversions!$D$81","v":{"$error":"#VALUE!"}},{"$f":"G17*IF(Calculations!$F$16=\"\",Calculations!$D$16,Calculations!$F$16)/(1-IF(Calculations!$F$17=\"\",Calculations!$D$17,Calculations!$F$17))/Conversions!$D$81","v":{"$error":"#VALUE!"}},{"$f":"H17*IF(Calculations!$F$16=\"\",Calculations!$D$16,Calculations!$F$16)/(1-IF(Calculations!$F$17=\"\",Calculations!$D$17,Calculations!$F$17))/Conversions!$D$81","v":{"$error":"#VALUE!"}},{"$f":"I17*IF(Calculations!$F$16=\"\",Calculations!$D$16,Calculations!$F$16)/(1-IF(Calculations!$F$17=\"\",Calculations!$D$17,Calculations!$F$17))/Conversions!$D$81","v":{"$error":"#VALUE!"}},{"$f":"J17*IF(Calculations!$F$16=\"\",Calculations!$D$16,Calculations!$F$16)/(1-IF(Calculations!$F$17=\"\",Calculations!$D$17,Calculations!$F$17))/Conversions!$D$81","v":{"$error":"#VALUE!"}},{"$f":"K17*IF(Calculations!$F$16=\"\",Calculations!$D$16,Calculations!$F$16)/(1-IF(Calculations!$F$17=\"\",Calculations!$D$17,Calculations!$F$17))/Conversions!$D$81","v":{"$error":"#VALUE!"}},{"$f":"L17*IF(Calculations!$F$16=\"\",Calculations!$D$16,Calculations!$F$16)/(1-IF(Calculations!$F$17=\"\",Calculations!$D$17,Calculations!$F$17))/Conversions!$D$81","v":{"$error":"#VALUE!"}},{"$error":"#VALUE!"},null,11,{"$f":"P17*Conversions!$K$59*IF(Calculations!$F$18=\"\",Calculations!$D$18,Calculations!$F$18)/Conversions!$D$81","v":{"$error":"#VALUE!"}},{"$f":"Q17*Conversions!$K$59*IF(Calculations!$F$18=\"\",Calculations!$D$18,Calculations!$F$18)/Conversions!$D$81","v":{"$error":"#VALUE!"}},{"$f":"R17*Conversions!$K$59*IF(Calculations!$F$18=\"\",Calculations!$D$18,Calculations!$F$18)/Conversions!$D$81","v":{"$error":"#VALUE!"}},{"$f":"S17*Conversions!$K$59*IF(Calculations!$F$18=\"\",Calculations!$D$18,Calculations!$F$18)/Conversions!$D$81","v":{"$error":"#VALUE!"}},{"$f":"T17*Conversions!$K$59*IF(Calculations!$F$18=\"\",Calculations!$D$18,Calculations!$F$18)/Conversions!$D$81","v":{"$error":"#VALUE!"}},{"$f":"U17*Conversions!$K$59*IF(Calculations!$F$18=\"\",Calculations!$D$18,Calculations!$F$18)/Conversions!$D$81","v":{"$error":"#VALUE!"}},{"$f":"V17*Conversions!$K$59*IF(Calculations!$F$18=\"\",Calculations!$D$18,Calculations!$F$18)/Conversions!$D$81","v":{"$error":"#VALUE!"}},{"$f":"W17*Conversions!$K$59*IF(Calculations!$F$18=\"\",Calculations!$D$18,Calculations!$F$18)/Conversions!$D$81","v":{"$error":"#VALUE!"}},{"$f":"X17*Conversions!$K$59*IF(Calculations!$F$18=\"\",Calculations!$D$18,Calculations!$F$18)/Conversions!$D$81","v":{"$error":"#VALUE!"}},{"$f":"Y17*Conversions!$K$59*IF(Calculations!$F$18=\"\",Calculations!$D$18,Calculations!$F$18)/Conversions!$D$81","v":{"$error":"#VALUE!"}},{"$error":"#VALUE!"},null,11,{"$error":"#VALUE!"},{"$error":"#VALUE!"},{"$error":"#VALUE!"},{"$error":"#VALUE!"},{"$error":"#VALUE!"},{"$error":"#VALUE!"},{"$error":"#VALUE!"},{"$error":"#VALUE!"},{"$error":"#VALUE!"},{"$error":"#VALUE!"},{"$error":"#VALUE!"},null,2023]
[null,12,{"$f":"C18*IF(Calculations!$F$16=\"\",Calculations!$D$16,Calculations!$F$16)/(1-IF(Calculations!$F$17=\"\",Calculations!$D$17,Calculations!$F$17))/Conversions!$D$81","v":{"$error":"#VALUE!"}},{"$f":"D18*IF(Calculations!$F$16=\"\",Calculations!$D$16,Calculations!$F$16)/(1-IF(Calculations!$F$17=\"\",Calculations!$D$17,Calculations!$F$17))/Conversions!$D$81","v":{"$error":"#VALUE!"}},{"$f":"E18*IF(Calculations!$F$16=\"\",Calculations!$D$16,Calculations!$F$16)/(1-IF(Calculations!$F$17=\"\",Calculations!$D$17,Calculations!$F$17))/Conversions!$D$81","v":{"$error":"#VALUE!"}},{"$f":"F18*IF(Calculations!$F$16=\"\",Calculations!$D$16,Calculations!$F$16)/(1-IF(Calculations!$F$17=\"\",Calculations!$D$17,Calculations!$F$17))/Conversions!$D$81","v":{"$error":"#VALUE!"}},{"$f":"G18*IF(Calculations!$F$16=\"\",Calculations!$D$16,Calculations!$F$16)/(1-IF(Calculations!$F$17=\"\",Calculations!$D$17,Calculations!$F$17))/Conversions!$D$81","v":{"$error":"#VALUE!"}},{"$f":"H18*IF(Calculations!$F$16=\"\",Calculations!$D$16,Calculations!$F$16)/(1-IF(Calculations!$F$17=\"\",Calculations!$D$17,Calculations!$F$17))/Conversions!$D$81","v":{"$error":"#VALUE!"}},{"$f":"I18*IF(Calculations!$F$16=\"\",Calculations!$D$16,Calculations!$F$16)/(1-IF(Calculations!$F$17=\"\",Calculations!$D$17,Calculations!$F$17))/Conversions!$D$81","v":{"$error":"#VALUE!"}},{"$f":"J18*IF(Calculations!$F$16=\"\",Calculations!$D$16,Calculations!$F$16)/(1-IF(Calculations!$F$17=\"\",Calculations!$D$17,Calculations!$F$17))/Conversions!$D$81","v":{"$error":"#VALUE!"}},{"$f":"K18*IF(Calculations!$F$16=\"\",Calculations!$D$16,Calculations!$F$16)/(1-IF(Calculations!$F$17=\"\",Calculations!$D$17,Calculations!$F$17))/Conversions!$D$81","v":{"$error":"#VALUE!"}},{"$f":"L18*IF(Calculations!$F$16=\"\",Calculations!$D$16,Calculations!$F$16)/(1-IF(Calculations!$F$17=\"\",Calculations!$D$17,Calculations!$F$17))/Conversions!$D$81","v":{"$error":"#VALUE!"}},{"$error":"#VALUE!"},null,12,{"$f":"P18*Conversions!$K$59*IF(Calculations!$F$18=\"\",Calculations!$D$18,Calculations!$F$18)/Conversions!$D$81","v":{"$error":"#VALUE!"}},{"$f":"Q18*Conversions!$K$59*IF(Calculations!$F$18=\"\",Calculations!$D$18,Calculations!$F$18)/Conversions!$D$81","v":{"$error":"#VALUE!"}},{"$f":"R18*Conversions!$K$59*IF(Calculations!$F$18=\"\",Calculations!$D$18,Calculations!$F$18)/Conversions!$D$81","v":{"$error":"#VALUE!"}},{"$f":"S18*Conversions!$K$59*IF(Calculations!$F$18=\"\",Calculations!$D$18,Calculations!$F$18)/Conversions!$D$81","v":{"$error":"#VALUE!"}},{"$f":"T18*Conversions!$K$59*IF(Calculations!$F$18=\"\",Calculations!$D$18,Calculations!$F$18)/Conversions!$D$81","v":{"$error":"#VALUE!"}},{"$f":"U18*Conversions!$K$59*IF(Calculations!$F$18=\"\",Calculations!$D$18,Calculations!$F$18)/Conversions!$D$81","v":{"$error":"#VALUE!"}},{"$f":"V18*Conversions!$K$59*IF(Calculations!$F$18=\"\",Calculations!$D$18,Calculations!$F$18)/Conversions!$D$81","v":{"$error":"#VALUE!"}},{"$f":"W18*Conversions!$K$59*IF(Calculations!$F$18=\"\",Calculations!$D$18,Calculations!$F$18)/Conversions!$D$81","v":{"$error":"#VALUE!"}},{"$f":"X18*Conversions!$K$59*IF(Calculations!$F$18=\"\",Calculations!$D$18,Calculations!$F$18)/Conversions!$D$81","v":{"$error":"#VALUE!"}},{"$f":"Y18*Conversions!$K$59*IF(Calculations!$F$18=\"\",Calculations!$D$18,Calculations!$F$18)/Conversions!$D$81","v":{"$error":"#VALUE!"}},{"$error":"#VALUE!"},null,12,{"$error":"#VALUE!"},{"$error":"#VALUE!"},{"$error":"#VALUE!"},{"$error":"#VALUE!"},{"$error":"#VALUE!"},{"$error":"#VALUE!"},{"$error":"#VALUE!"},{"$error":"#VALUE!"},{"$error":"#VALUE!"},{"$error":"#VALUE!"},{"$error":"#VALUE!"},null,2024]
[null,13,{"$f":"C19*IF(Calculations!$F$16=\"\",Calculations!$D$16,Calculations!$F$16)/(1-IF(Calculations!$F$17=\"\",Calculations!$D$17,Calculations!$F$17))/Conversions!$D$81","v":{"$error":"#VALUE!"}},{"$f":"D19*IF(Calculations!$F$16=\"\",Calculations!$D$16,Calculations!$F$16)/(1-IF(Calculations!$F$17=\"\",Calculations!$D$17,Calculations!$F$17))/Conversions!$D$81","v":{"$error":"#VALUE!"}},{"$f":"E19*IF(Calculations!$F$16=\"\",Calculations!$D$16,Calculations!$F$16)/(1-IF(Calculations!$F$17=\"\",Calculations!$D$17,Calculations!$F$17))/Conversions!$D$81","v":{"$error":"#VALUE!"}},{"$f":"F19*IF(Calculations!$F$16=\"\",Calculations!$D$16,Calculations!$F$16)/(1-IF(Calculations!$F$17=\"\",Calculations!$D$17,Calculations!$F$17))/Conversions!$D$81","v":{"$error":"#VALUE!"}},{"$f":"G19*IF(Calculations!$F$16=\"\",Calculations!$D$16,Calculations!$F$16)/(1-IF(Calculations!$F$17=\"\",Calculations!$D$17,Calculations!$F$17))/Conversions!$D$81","v":{"$error":"#VALUE!"}},{"$f":"H19*IF(Calculations!$F$16=\"\",Calculations!$D$16,Calculations!$F$16)/(1-IF(Calculations!$F$17=\"\",Calculations!$D$17,Calculations!$F$17))/Conversions!$D$81","v":{"$error":"#VALUE!"}},{"$f":"I19*IF(Calculations!$F$16=\"\",Calculations!$D$16,Calculations!$F$16)/(1-IF(Calculations!$F$17=\"\",Calculations!$D$17,Calculations!$F$17))/Conversions!$D$81","v":{"$error":"#VALUE!"}},{"$f":"J19*IF(Calculations!$F$16=\"\",Calculations!$D$16,Calculations!$F$16)/(1-IF(Calculations!$F$17=\"\",Calculations!$D$17,Calculations!$F$17))/Conversions!$D$81","v":{"$error":"#VALUE!"}},{"$f":"K19*IF(Calculations!$F$16=\"\",Calculations!$D$16,Calculations!$F$16)/(1-IF(Calculations!$F$17=\"\",Calculations!$D$17,Calculations!$F$17))/Conversions!$D$81","v":{"$error":"#VALUE!"}},{"$f":"L19*IF(Calculations!$F$16=\"\",Calculations!$D$16,Calculations!$F$16)/(1-IF(Calculations!$F$17=\"\",Calculations!$D$17,Calculations!$F$17))/Conversions!$D$81","v":{"$error":"#VALUE!"}},{"$error":"#VALUE!"},null,13,{"$f":"P19*Conversions!$K$59*IF(Calculations!$F$18=\"\",Calculations!$D$18,Calculations!$F$18)/Conversions!$D$81","v":{"$error":"#VALUE!"}},{"$f":"Q19*Conversions!$K$59*IF(Calculations!$F$18=\"\",Calculations!$D$18,Calculations!$F$18)/Conversions!$D$81","v":{"$error":"#VALUE!"}},{"$f":"R19*Conversions!$K$59*IF(Calculations!$F$18=\"\",Calculations!$D$18,Calculations!$F$18)/Conversions!$D$81","v":{"$error":"#VALUE!"}},{"$f":"S19*Conversions!$K$59*IF(Calculations!$F$18=\"\",Calculations!$D$18,Calculations!$F$18)/Conversions!$D$81","v":{"$error":"#VALUE!"}},{"$f":"T19*Conversions!$K$59*IF(Calculations!$F$18=\"\",Calculations!$D$18,Calculations!$F$18)/Conversions!$D$81","v":{"$error":"#VALUE!"}},{"$f":"U19*Conversions!$K$59*IF(Calculations!$F$18=\"\",Calculations!$D$18,Calculations!$F$18)/Conversions!$D$81","v":{"$error":"#VALUE!"}},{"$f":"V19*Conversions!$K$59*IF(Calculations!$F$18=\"\",Calculations!$D$18,Calculations!$F$18)/Conversions!$D$81","v":{"$error":"#VALUE!"}},{"$f":"W19*Conversions!$K$59*IF(Calculations!$F$18=\"\",Calculations!$D$18,Calculations!$F$18)/Conversions!$D$81","v":{"$error":"#VALUE!"}},{"$f":"X19*Conversions!$K$59*IF(Calculations!$F$18=\"\",Calculations!$D$18,Calculations!$F$18)/Conversions!$D$81","v":{"$error":"#VALUE!"}},{"$f":"Y19*Conversions!$K$59*IF(Calculations!$F$18=\"\",Calculations!$D$18,Calculations!$F$18)/Conversions!$D$81","v":{"$error":"#VALUE!"}},{"$error":"#VALUE!"},null,13,{"$error":"#VALUE!"},{"$error":"#VALUE!"},{"$error":"#VALUE!"},{"$error":"#VALUE!"},{"$error":"#VALUE!"},{"$error":"#VALUE!"},{"$error":"#VALUE!"},{"$error":"#VALUE!"},{"$error":"#VALUE!"},{"$error":"#VALUE!"},{"$error":"#VALUE!"},null,2025]
[null,14,{"$f":"C20*IF(Calculations!$F$16=\"\",Calculations!$D$16,Calculations!$F$16)/(1-IF(Calculations!$F$17=\"\",Calculations!$D$17,Calculations!$F$17))/Conversions!$D$81","v":{"$error":"#VALUE!"}},{"$f":"D20*IF(Calculations!$F$16=\"\",Calculations!$D$16,Calculations!$F$16)/(1-IF(Calculations!$F$17=\"\",Calculations!$D$17,Calculations!$F$17))/Conversions!$D$81","v":{"$error":"#VALUE!"}},{"$f":"E20*IF(Calculations!$F$16=\"\",Calculations!$D$16,Calculations!$F$16)/(1-IF(Calculations!$F$17=\"\",Calculations!$D$17,Calculations!$F$17))/Conversions!$D$81","v":{"$error":"#VALUE!"}},{"$f":"F20*IF(Calculations!$F$16=\"\",Calculations!$D$16,Calculations!$F$16)/(1-IF(Calculations!$F$17=\"\",Calculations!$D$17,Calculations!$F$17))/Conversions!$D$81","v":{"$error":"#VALUE!"}},{"$f":"G20*IF(Calculations!$F$16=\"\",Calculations!$D$16,Calculations!$F$16)/(1-IF(Calculations!$F$17=\"\",Calculations!$D$17,Calculations!$F$17))/Conversions!$D$81","v":{"$error":"#VALUE!"}},{"$f":"H20*IF(Calculations!$F$16=\"\",Calculations!$D$16,Calculations!$F$16)/(1-IF(Calculations!$F$17=\"\",Calculations!$D$17,Calculations!$F$17))/Conversions!$D$81","v":{"$error":"#VALUE!"}},{"$f":"I20*IF(Calculations!$F$16=\"\",Calculations!$D$16,Calculations!$F$16)/(1-IF(Calculations!$F$17=\"\",Calculations!$D$17,Calculations!$F$17))/Conversions!$D$81","v":{"$error":"#VALUE!"}},{"$f":"J20*IF(Calculations!$F$16=\"\",Calculations!$D$16,Calculations!$F$16)/(1-IF(Calculations!$F$17=\"\",Calculations!$D$17,Calculations!$F$17))/Conversions!$D$81","v":{"$error":"#VALUE!"}},{"$f":"K20*IF(Calculations!$F$16=\"\",Calculations!$D$16,Calculations!$F$16)/(1-IF(Calculations!$F$17=\"\",Calculations!$D$17,Calculations!$F$17))/Conversions!$D$81","v":{"$error":"#VALUE!"}},{"$f":"L20*IF(Calculations!$F$16=\"\",Calculations!$D$16,Calculations!$F$16)/(1-IF(Calculations!$F$17=\"\",Calculations!$D$17,Calculations!$F$17))/Conversions!$D$81","v":{"$error":"#VALUE!"}},{"$error":"#VALUE!"},null,14,{"$f":"P20*Conversions!$K$59*IF(Calculations!$F$18=\"\",Calculations!$D$18,Calculations!$F$18)/Conversions!$D$81","v":{"$error":"#VALUE!"}},{"$f":"Q20*Conversions!$K$59*IF(Calculations!$F$18=\"\",Calculations!$D$18,Calculations!$F$18)/Conversions!$D$81","v":{"$error":"#VALUE!"}},{"$f":"R20*Conversions!$K$59*IF(Calculations!$F$18=\"\",Calculations!$D$18,Calculations!$F$18)/Conversions!$D$81","v":{"$error":"#VALUE!"}},{"$f":"S20*Conversions!$K$59*IF(Calculations!$F$18=\"\",Calculations!$D$18,Calculations!$F$18)/Conversions!$D$81","v":{"$error":"#VALUE!"}},{"$f":"T20*Conversions!$K$59*IF(Calculations!$F$18=\"\",Calculations!$D$18,Calculations!$F$18)/Conversions!$D$81","v":{"$error":"#VALUE!"}},{"$f":"U20*Conversions!$K$59*IF(Calculations!$F$18=\"\",Calculations!$D$18,Calculations!$F$18)/Conversions!$D$81","v":{"$error":"#VALUE!"}},{"$f":"V20*Conversions!$K$59*IF(Calculations!$F$18=\"\",Calculations!$D$18,Calculations!$F$18)/Conversions!$D$81","v":{"$error":"#VALUE!"}},{"$f":"W20*Conversions!$K$59*IF(Calculations!$F$18=\"\",Calculations!$D$18,Calculations!$F$18)/Conversions!$D$81","v":{"$error":"#VALUE!"}},{"$f":"X20*Conversions!$K$59*IF(Calculations!$F$18=\"\",Calculations!$D$18,Calculations!$F$18)/Conversions!$D$81","v":{"$error":"#VALUE!"}},{"$f":"Y20*Conversions!$K$59*IF(Calculations!$F$18=\"\",Calculations!$D$18,Calculations!$F$18)/Conversions!$D$81","v":{"$error":"#VALUE!"}},{"$error":"#VALUE!"},null,14,{"$error":"#VALUE!"},{"$error":"#VALUE!"},{"$error":"#VALUE!"},{"$error":"#VALUE!"},{"$error":"#VALUE!"},{"$error":"#VALUE!"},{"$error":"#VALUE!"},{"$error":"#VALUE!"},{"$error":"#VALUE!"},{"$error":"#VALUE!"},{"$error":"#VALUE!"},null,2026]
[null,15,{"$f":"C21*IF(Calculations!$F$16=\"\",Calculations!$D$16,Calculations!$F$16)/(1-IF(Calculations!$F$17=\"\",Calculations!$D$17,Calculations!$F$17))/Conversions!$D$81","v":{"$error":"#VALUE!"}},{"$f":"D21*IF(Calculations!$F$16=\"\",Calculations!$D$16,Calculations!$F$16)/(1-IF(Calculations!$F$17=\"\",Calculations!$D$17,Calculations!$F$17))/Conversions!$D$81","v":{"$error":"#VALUE!"}},{"$f":"E21*IF(Calculations!$F$16=\"\",Calculations!$D$16,Calculations!$F$16)/(1-IF(Calculations!$F$17=\"\",Calculations!$D$17,Calculations!$F$17))/Conversions!$D$81","v":{"$error":"#VALUE!"}},{"$f":"F21*IF(Calculations!$F$16=\"\",Calculations!$D$16,Calculations!$F$16)/(1-IF(Calculations!$F$17=\"\",Calculations!$D$17,Calculations!$F$17))/Conversions!$D$81","v":{"$error":"#VALUE!"}},{"$f":"G21*IF(Calculations!$F$16=\"\",Calculations!$D$16,Calculations!$F$16)/(1-IF(Calculations!$F$17=\"\",Calculations!$D$17,Calculations!$F$17))/Conversions!$D$81","v":{"$error":"#VALUE!"}},{"$f":"H21*IF(Calculations!$F$16=\"\",Calculations!$D$16,Calculations!$F$16)/(1-IF(Calculations!$F$17=\"\",Calculations!$D$17,Calculations!$F$17))/Conversions!$D$81","v":{"$error":"#VALUE!"}},{"$f":"I21*IF(Calculations!$F$16=\"\",Calculations!$D$16,Calculations!$F$16)/(1-IF(Calculations!$F$17=\"\",Calculations!$D$17,Calculations!$F$17))/Conversions!$D$81","v":{"$error":"#VALUE!"}},{"$f":"J21*IF(Calculations!$F$16=\"\",Calculations!$D$16,Calculations!$F$16)/(1-IF(Calculations!$F$17=\"\",Calculations!$D$17,Calculations!$F$17))/Conversions!$D$81","v":{"$error":"#VALUE!"}},{"$f":"K21*IF(Calculations!$F$16=\"\",Calculations!$D$16,Calculations!$F$16)/(1-IF(Calculations!$F$17=\"\",Calculations!$D$17,Calculations!$F$17))/Conversions!$D$81","v":{"$error":"#VALUE!"}},{"$f":"L21*IF(Calculations!$F$16=\"\",Calculations!$D$16,Calculations!$F$16)/(1-IF(Calculations!$F$17=\"\",Calculations!$D$17,Calculations!$F$17))/Conversions!$D$81","v":{"$error":"#VALUE!"}},{"$error":"#VALUE!"},null,15,{"$f":"P21*Conversions!$K$59*IF(Calculations!$F$18=\"\",Calculations!$D$18,Calculations!$F$18)/Conversions!$D$81","v":{"$error":"#VALUE!"}},{"$f":"Q21*Conversions!$K$59*IF(Calculations!$F$18=\"\",Calculations!$D$18,Calculations!$F$18)/Conversions!$D$81","v":{"$error":"#VALUE!"}},{"$f":"R21*Conversions!$K$59*IF(Calculations!$F$18=\"\",Calculations!$D$18,Calculations!$F$18)/Conversions!$D$81","v":{"$error":"#VALUE!"}},{"$f":"S21*Conversions!$K$59*IF(Calculations!$F$18=\"\",Calculations!$D$18,Calculations!$F$18)/Conversions!$D$81","v":{"$error":"#VALUE!"}},{"$f":"T21*Conversions!$K$59*IF(Calculations!$F$18=\"\",Calculations!$D$18,Calculations!$F$18)/Conversions!$D$81","v":{"$error":"#VALUE!"}},{"$f":"U21*Conversions!$K$59*IF(Calculations!$F$18=\"\",Calculations!$D$18,Calculations!$F$18)/Conversions!$D$81","v":{"$error":"#VALUE!"}},{"$f":"V21*Conversions!$K$59*IF(Calculations!$F$18=\"\",Calculations!$D$18,Calculations!$F$18)/Conversions!$D$81","v":{"$error":"#VALUE!"}},{"$f":"W21*Conversions!$K$59*IF(Calculations!$F$18=\"\",Calculations!$D$18,Calculations!$F$18)/Conversions!$D$81","v":{"$error":"#VALUE!"}},{"$f":"X21*Conversions!$K$59*IF(Calculations!$F$18=\"\",Calculations!$D$18,Calculations!$F$18)/Conversions!$D$81","v":{"$error":"#VALUE!"}},{"$f":"Y21*Conversions!$K$59*IF(Calculations!$F$18=\"\",Calculations!$D$18,Calculations!$F$18)/Conversions!$D$81","v":{"$error":"#VALUE!"}},{"$error":"#VALUE!"},null,15,{"$error":"#VALUE!"},{"$error":"#VALUE!"},{"$error":"#VALUE!"},{"$error":"#VALUE!"},{"$error":"#VALUE!"},{"$error":"#VALUE!"},{"$error":"#VALUE!"},{"$error":"#VALUE!"},{"$error":"#VALUE!"},{"$error":"#VALUE!"},{"$error":"#VALUE!"},null,2027]
[null,16,{"$f":"C22*IF(Calculations!$F$16=\"\",Calculations!$D$16,Calculations!$F$16)/(1-IF(Calculations!$F$17=\"\",Calculations!$D$17,Calculations!$F$17))/Conversions!$D$81","v":{"$error":"#VALUE!"}},{"$f":"D22*IF(Calculations!$F$16=\"\",Calculations!$D$16,Calculations!$F$16)/(1-IF(Calculations!$F$17=\"\",Calculations!$D$17,Calculations!$F$17))/Conversions!$D$81","v":{"$error":"#VALUE!"}},{"$f":"E22*IF(Calculations!$F$16=\"\",Calculations!$D$16,Calculations!$F$16)/(1-IF(Calculations!$F$17=\"\",Calculations!$D$17,Calculations!$F$17))/Conversions!$D$81","v":{"$error":"#VALUE!"}},{"$f":"F22*IF(Calculations!$F$16=\"\",Calculations!$D$16,Calculations!$F$16)/(1-IF(Calculations!$F$17=\"\",Calculations!$D$17,Calculations!$F$17))/Conversions!$D$81","v":{"$error":"#VALUE!"}},{"$f":"G22*IF(Calculations!$F$16=\"\",Calculations!$D$16,Calculations!$F$16)/(1-IF(Calculations!$F$17=\"\",Calculations!$D$17,Calculations!$F$17))/Conversions!$D$81","v":{"$error":"#VALUE!"}},{"$f":"H22*IF(Calculations!$F$16=\"\",Calculations!$D$16,Calculations!$F$16)/(1-IF(Calculations!$F$17=\"\",Calculations!$D$17,Calculations!$F$17))/Conversions!$D$81","v":{"$error":"#VALUE!"}},{"$f":"I22*IF(Calculations!$F$16=\"\",Calculations!$D$16,Calculations!$F$16)/(1-IF(Calculations!$F$17=\"\",Calculations!$D$17,Calculations!$F$17))/Conversions!$D$81","v":{"$error":"#VALUE!"}},{"$f":"J22*IF(Calculations!$F$16=\"\",Calculations!$D$16,Calculations!$F$16)/(1-IF(Calculations!$F$17=\"\",Calculations!$D$17,Calculations!$F$17))/Conversions!$D$81","v":{"$error":"#VALUE!"}},{"$f":"K22*IF(Calculations!$F$16=\"\",Calculations!$D$16,Calculations!$F$16)/(1-IF(Calculations!$F$17=\"\",Calculations!$D$17,Calculations!$F$17))/Conversions!$D$81","v":{"$error":"#VALUE!"}},{"$f":"L22*IF(Calculations!$F$16=\"\",Calculations!$D$16,Calculations!$F$16)/(1-IF(Calculations!$F$17=\"\",Calculations!$D$17,Calculations!$F$17))/Conversions!$D$81","v":{"$error":"#VALUE!"}},{"$error":"#VALUE!"},null,16,{"$f":"P22*Conversions!$K$59*IF(Calculations!$F$18=\"\",Calculations!$D$18,Calculations!$F$18)/Conversions!$D$81","v":{"$error":"#VALUE!"}},{"$f":"Q22*Conversions!$K$59*IF(Calculations!$F$18=\"\",Calculations!$D$18,Calculations!$F$18)/Conversions!$D$81","v":{"$error":"#VALUE!"}},{"$f":"R22*Conversions!$K$59*IF(Calculations!$F$18=\"\",Calculations!$D$18,Calculations!$F$18)/Conversions!$D$81","v":{"$error":"#VALUE!"}},{"$f":"S22*Conversions!$K$59*IF(Calculations!$F$18=\"\",Calculations!$D$18,Calculations!$F$18)/Conversions!$D$81","v":{"$error":"#VALUE!"}},{"$f":"T22*Conversions!$K$59*IF(Calculations!$F$18=\"\",Calculations!$D$18,Calculations!$F$18)/Conversions!$D$81","v":{"$error":"#VALUE!"}},{"$f":"U22*Conversions!$K$59*IF(Calculations!$F$18=\"\",Calculations!$D$18,Calculations!$F$18)/Conversions!$D$81","v":{"$error":"#VALUE!"}},{"$f":"V22*Conversions!$K$59*IF(Calculations!$F$18=\"\",Calculations!$D$18,Calculations!$F$18)/Conversions!$D$81","v":{"$error":"#VALUE!"}},{"$f":"W22*Conversions!$K$59*IF(Calculations!$F$18=\"\",Calculations!$D$18,Calculations!$F$18)/Conversions!$D$81","v":{"$error":"#VALUE!"}},{"$f":"X22*Conversions!$K$59*IF(Calculations!$F$18=\"\",Calculations!$D$18,Calculations!$F$18)/Conversions!$D$81","v":{"$error":"#VALUE!"}},{"$f":"Y22*Conversions!$K$59*IF(Calculations!$F$18=\"\",Calculations!$D$18,Calculations!$F$18)/Conversions!$D$81","v":{"$error":"#VALUE!"}},{"$error":"#VALUE!"},null,16,{"$error":"#VALUE!"},{"$error":"#VALUE!"},{"$error":"#VALUE!"},{"$error":"#VALUE!"},{"$error":"#VALUE!"},{"$error":"#VALUE!"},{"$error":"#VALUE!"},{"$error":"#VALUE!"},{"$error":"#VALUE!"},{"$error":"#VALUE!"},{"$error":"#VALUE!"},null,2028]
[null,17,{"$f":"C23*IF(Calculations!$F$16=\"\",Calculations!$D$16,Calculations!$F$16)/(1-IF(Calculations!$F$17=\"\",Calculations!$D$17,Calculations!$F$17))/Conversions!$D$81","v":{"$error":"#VALUE!"}},{"$f":"D23*IF(Calculations!$F$16=\"\",Calculations!$D$16,Calculations!$F$16)/(1-IF(Calculations!$F$17=\"\",Calculations!$D$17,Calculations!$F$17))/Conversions!$D$81","v":{"$error":"#VALUE!"}},{"$f":"E23*IF(Calculations!$F$16=\"\",Calculations!$D$16,Calculations!$F$16)/(1-IF(Calculations!$F$17=\"\",Calculations!$D$17,Calculations!$F$17))/Conversions!$D$81","v":{"$error":"#VALUE!"}},{"$f":"F23*IF(Calculations!$F$16=\"\",Calculations!$D$16,Calculations!$F$16)/(1-IF(Calculations!$F$17=\"\",Calculations!$D$17,Calculations!$F$17))/Conversions!$D$81","v":{"$error":"#VALUE!"}},{"$f":"G23*IF(Calculations!$F$16=\"\",Calculations!$D$16,Calculations!$F$16)/(1-IF(Calculations!$F$17=\"\",Calculations!$D$17,Calculations!$F$17))/Conversions!$D$81","v":{"$error":"#VALUE!"}},{"$f":"H23*IF(Calculations!$F$16=\"\",Calculations!$D$16,Calculations!$F$16)/(1-IF(Calculations!$F$17=\"\",Calculations!$D$17,Calculations!$F$17))/Conversions!$D$81","v":{"$error":"#VALUE!"}},{"$f":"I23*IF(Calculations!$F$16=\"\",Calculations!$D$16,Calculations!$F$16)/(1-IF(Calculations!$F$17=\"\",Calculations!$D$17,Calculations!$F$17))/Conversions!$D$81","v":{"$error":"#VALUE!"}},{"$f":"J23*IF(Calculations!$F$16=\"\",Calculations!$D$16,Calculations!$F$16)/(1-IF(Calculations!$F$17=\"\",Calculations!$D$17,Calculations!$F$17))/Conversions!$D$81","v":{"$error":"#VALUE!"}},{"$f":"K23*IF(Calculations!$F$16=\"\",Calculations!$D$16,Calculations!$F$16)/(1-IF(Calculations!$F$17=\"\",Calculations!$D$17,Calculations!$F$17))/Conversions!$D$81","v":{"$error":"#VALUE!"}},{"$f":"L23*IF(Calculations!$F$16=\"\",Calculations!$D$16,Calculations!$F$16)/(1-IF(Calculations!$F$17=\"\",Calculations!$D$17,Calculations!$F$17))/Conversions!$D$81","v":{"$error":"#VALUE!"}},{"$error":"#VALUE!"},null,17,{"$f":"P23*Conversions!$K$59*IF(Calculations!$F$18=\"\",Calculations!$D$18,Calculations!$F$18)/Conversions!$D$81","v":{"$error":"#VALUE!"}},{"$f":"Q23*Conversions!$K$59*IF(Calculations!$F$18=\"\",Calculations!$D$18,Calculations!$F$18)/Conversions!$D$81","v":{"$error":"#VALUE!"}},{"$f":"R23*Conversions!$K$59*IF(Calculations!$F$18=\"\",Calculations!$D$18,Calculations!$F$18)/Conversions!$D$81","v":{"$error":"#VALUE!"}},{"$f":"S23*Conversions!$K$59*IF(Calculations!$F$18=\"\",Calculations!$D$18,Calculations!$F$18)/Conversions!$D$81","v":{"$error":"#VALUE!"}},{"$f":"T23*Conversions!$K$59*IF(Calculations!$F$18=\"\",Calculations!$D$18,Calculations!$F$18)/Conversions!$D$81","v":{"$error":"#VALUE!"}},{"$f":"U23*Conversions!$K$59*IF(Calculations!$F$18=\"\",Calculations!$D$18,Calculations!$F$18)/Conversions!$D$81","v":{"$error":"#VALUE!"}},{"$f":"V23*Conversions!$K$59*IF(Calculations!$F$18=\"\",Calculations!$D$18,Calculations!$F$18)/Conversions!$D$81","v":{"$error":"#VALUE!"}},{"$f":"W23*Conversions!$K$59*IF(Calculations!$F$18=\"\",Calculations!$D$18,Calculations!$F$18)/Conversions!$D$81","v":{"$error":"#VALUE!"}},{"$f":"X23*Conversions!$K$59*IF(Calculations!$F$18=\"\",Calculations!$D$18,Calculations!$F$18)/Conversions!$D$81","v":{"$error":"#VALUE!"}},{"$f":"Y23*Conversions!$K$59*IF(Calculations!$F$18=\"\",Calculations!$D$18,Calculations!$F$18)/Conversions!$D$81","v":{"$error":"#VALUE!"}},{"$error":"#VALUE!"},null,17,{"$error":"#VALUE!"},{"$error":"#VALUE!"},{"$error":"#VALUE!"},{"$error":"#VALUE!"},{"$error":"#VALUE!"},{"$error":"#VALUE!"},{"$error":"#VALUE!"},{"$error":"#VALUE!"},{"$error":"#VALUE!"},{"$error":"#VALUE!"},{"$error":"#VALUE!"},null,2029]
[null,18,{"$f":"C24*IF(Calculations!$F$16=\"\",Calculations!$D$16,Calculations!$F$16)/(1-IF(Calculations!$F$17=\"\",Calculations!$D$17,Calculations!$F$17))/Conversions!$D$81","v":{"$error":"#VALUE!"}},{"$f":"D24*IF(Calculations!$F$16=\"\",Calculations!$D$16,Calculations!$F$16)/(1-IF(Calculations!$F$17=\"\",Calculations!$D$17,Calculations!$F$17))/Conversions!$D$81","v":{"$error":"#VALUE!"}},{"$f":"E24*IF(Calculations!$F$16=\"\",Calculations!$D$16,Calculations!$F$16)/(1-IF(Calculations!$F$17=\"\",Calculations!$D$17,Calculations!$F$17))/Conversions!$D$81","v":{"$error":"#VALUE!"}},{"$f":"F24*IF(Calculations!$F$16=\"\",Calculations!$D$16,Calculations!$F$16)/(1-IF(Calculations!$F$17=\"\",Calculations!$D$17,Calculations!$F$17))/Conversions!$D$81","v":{"$error":"#VALUE!"}},{"$f":"G24*IF(Calculations!$F$16=\"\",Calculations!$D$16,Calculations!$F$16)/(1-IF(Calculations!$F$17=\"\",Calculations!$D$17,Calculations!$F$17))/Conversions!$D$81","v":{"$error":"#VALUE!"}},{"$f":"H24*IF(Calculations!$F$16=\"\",Calculations!$D$16,Calculations!$F$16)/(1-IF(Calculations!$F$17=\"\",Calculations!$D$17,Calculations!$F$17))/Conversions!$D$81","v":{"$error":"#VALUE!"}},{"$f":"I24*IF(Calculations!$F$16=\"\",Calculations!$D$16,Calculations!$F$16)/(1-IF(Calculations!$F$17=\"\",Calculations!$D$17,Calculations!$F$17))/Conversions!$D$81","v":{"$error":"#VALUE!"}},{"$f":"J24*IF(Calculations!$F$16=\"\",Calculations!$D$16,Calculations!$F$16)/(1-IF(Calculations!$F$17=\"\",Calculations!$D$17,Calculations!$F$17))/Conversions!$D$81","v":{"$error":"#VALUE!"}},{"$f":"K24*IF(Calculations!$F$16=\"\",Calculations!$D$16,Calculations!$F$16)/(1-IF(Calculations!$F$17=\"\",Calculations!$D$17,Calculations!$F$17))/Conversions!$D$81","v":{"$error":"#VALUE!"}},{"$f":"L24*IF(Calculations!$F$16=\"\",Calculations!$D$16,Calculations!$F$16)/(1-IF(Calculations!$F$17=\"\",Calculations!$D$17,Calculations!$F$17))/Conversions!$D$81","v":{"$error":"#VALUE!"}},{"$error":"#VALUE!"},null,18,{"$f":"P24*Conversions!$K$59*IF(Calculations!$F$18=\"\",Calculations!$D$18,Calculations!$F$18)/Conversions!$D$81","v":{"$error":"#VALUE!"}},{"$f":"Q24*Conversions!$K$59*IF(Calculations!$F$18=\"\",Calculations!$D$18,Calculations!$F$18)/Conversions!$D$81","v":{"$error":"#VALUE!"}},{"$f":"R24*Conversions!$K$59*IF(Calculations!$F$18=\"\",Calculations!$D$18,Calculations!$F$18)/Conversions!$D$81","v":{"$error":"#VALUE!"}},{"$f":"S24*Conversions!$K$59*IF(Calculations!$F$18=\"\",Calculations!$D$18,Calculations!$F$18)/Conversions!$D$81","v":{"$error":"#VALUE!"}},{"$f":"T24*Conversions!$K$59*IF(Calculations!$F$18=\"\",Calculations!$D$18,Calculations!$F$18)/Conversions!$D$81","v":{"$error":"#VALUE!"}},{"$f":"U24*Conversions!$K$59*IF(Calculations!$F$18=\"\",Calculations!$D$18,Calculations!$F$18)/Conversions!$D$81","v":{"$error":"#VALUE!"}},{"$f":"V24*Conversions!$K$59*IF(Calculations!$F$18=\"\",Calculations!$D$18,Calculations!$F$18)/Conversions!$D$81","v":{"$error":"#VALUE!"}},{"$f":"W24*Conversions!$K$59*IF(Calculations!$F$18=\"\",Calculations!$D$18,Calculations!$F$18)/Conversions!$D$81","v":{"$error":"#VALUE!"}},{"$f":"X24*Conversions!$K$59*IF(Calculations!$F$18=\"\",Calculations!$D$18,Calculations!$F$18)/Conversions!$D$81","v":{"$error":"#VALUE!"}},{"$f":"Y24*Conversions!$K$59*IF(Calculations!$F$18=\"\",Calculations!$D$18,Calculations!$F$18)/Conversions!$D$81","v":{"$error":"#VALUE!"}},{"$error":"#VALUE!"},null,18,{"$error":"#VALUE!"},{"$error":"#VALUE!"},{"$error":"#VALUE!"},{"$error":"#VALUE!"},{"$error":"#VALUE!"},{"$error":"#VALUE!"},{"$error":"#VALUE!"},{"$error":"#VALUE!"},{"$error":"#VALUE!"},{"$error":"#VALUE!"},{"$error":"#VALUE!"},null,2030]
[null,19,{"$f":"C25*IF(Calculations!$F$16=\"\",Calculations!$D$16,Calculations!$F$16)/(1-IF(Calculations!$F$17=\"\",Calculations!$D$17,Calculations!$F$17))/Conversions!$D$81","v":{"$error":"#VALUE!"}},{"$f":"D25*IF(Calculations!$F$16=\"\",Calculations!$D$16,Calculations!$F$16)/(1-IF(Calculations!$F$17=\"\",Calculations!$D$17,Calculations!$F$17))/Conversions!$D$81","v":{"$error":"#VALUE!"}},{"$f":"E25*IF(Calculations!$F$16=\"\",Calculations!$D$16,Calculations!$F$16)/(1-IF(Calculations!$F$17=\"\",Calculations!$D$17,Calculations!$F$17))/Conversions!$D$81","v":{"$error":"#VALUE!"}},{"$f":"F25*IF(Calculations!$F$16=\"\",Calculations!$D$16,Calculations!$F$16)/(1-IF(Calculations!$F$17=\"\",Calculations!$D$17,Calculations!$F$17))/Conversions!$D$81","v":{"$error":"#VALUE!"}},{"$f":"G25*IF(Calculations!$F$16=\"\",Calculations!$D$16,Calculations!$F$16)/(1-IF(Calculations!$F$17=\"\",Calculations!$D$17,Calculations!$F$17))/Conversions!$D$81","v":{"$error":"#VALUE!"}},{"$f":"H25*IF(Calculations!$F$16=\"\",Calculations!$D$16,Calculations!$F$16)/(1-IF(Calculations!$F$17=\"\",Calculations!$D$17,Calculations!$F$17))/Conversions!$D$81","v":{"$error":"#VALUE!"}},{"$f":"I25*IF(Calculations!$F$16=\"\",Calculations!$D$16,Calculations!$F$16)/(1-IF(Calculations!$F$17=\"\",Calculations!$D$17,Calculations!$F$17))/Conversions!$D$81","v":{"$error":"#VALUE!"}},{"$f":"J25*IF(Calculations!$F$16=\"\",Calculations!$D$16,Calculations!$F$16)/(1-IF(Calculations!$F$17=\"\",Calculations!$D$17,Calculations!$F$17))/Conversions!$D$81","v":{"$error":"#VALUE!"}},{"$f":"K25*IF(Calculations!$F$16=\"\",Calculations!$D$16,Calculations!$F$16)/(1-IF(Calculations!$F$17=\"\",Calculations!$D$17,Calculations!$F$17))/Conversions!$D$81","v":{"$error":"#VALUE!"}},{"$f":"L25*IF(Calculations!$F$16=\"\",Calculations!$D$16,Calculations!$F$16)/(1-IF(Calculations!$F$17=\"\",Calculations!$D$17,Calculations!$F$17))/Conversions!$D$81","v":{"$error":"#VALUE!"}},{"$error":"#VALUE!"},null,19,{"$f":"P25*Conversions!$K$59*IF(Calculations!$F$18=\"\",Calculations!$D$18,Calculations!$F$18)/Conversions!$D$81","v":{"$error":"#VALUE!"}},{"$f":"Q25*Conversions!$K$59*IF(Calculations!$F$18=\"\",Calculations!$D$18,Calculations!$F$18)/Conversions!$D$81","v":{"$error":"#VALUE!"}},{"$f":"R25*Conversions!$K$59*IF(Calculations!$F$18=\"\",Calculations!$D$18,Calculations!$F$18)/Conversions!$D$81","v":{"$error":"#VALUE!"}},{"$f":"S25*Conversions!$K$59*IF(Calculations!$F$18=\"\",Calculations!$D$18,Calculations!$F$18)/Conversions!$D$81","v":{"$error":"#VALUE!"}},{"$f":"T25*Conversions!$K$59*IF(Calculations!$F$18=\"\",Calculations!$D$18,Calculations!$F$18)/Conversions!$D$81","v":{"$error":"#VALUE!"}},{"$f":"U25*Conversions!$K$59*IF(Calculations!$F$18=\"\",Calculations!$D$18,Calculations!$F$18)/Conversions!$D$81","v":{"$error":"#VALUE!"}},{"$f":"V25*Conversions!$K$59*IF(Calculations!$F$18=\"\",Calculations!$D$18,Calculations!$F$18)/Conversions!$D$81","v":{"$error":"#VALUE!"}},{"$f":"W25*Conversions!$K$59*IF(Calculations!$F$18=\"\",Calculations!$D$18,Calculations!$F$18)/Conversions!$D$81","v":{"$error":"#VALUE!"}},{"$f":"X25*Conversions!$K$59*IF(Calculations!$F$18=\"\",Calculations!$D$18,Calculations!$F$18)/Conversions!$D$81","v":{"$error":"#VALUE!"}},{"$f":"Y25*Conversions!$K$59*IF(Calculations!$F$18=\"\",Calculations!$D$18,Calculations!$F$18)/Conversions!$D$81","v":{"$error":"#VALUE!"}},{"$error":"#VALUE!"},null,19,{"$error":"#VALUE!"},{"$error":"#VALUE!"},{"$error":"#VALUE!"},{"$error":"#VALUE!"},{"$error":"#VALUE!"},{"$error":"#VALUE!"},{"$error":"#VALUE!"},{"$error":"#VALUE!"},{"$error":"#VALUE!"},{"$error":"#VALUE!"},{"$error":"#VALUE!"},null,2031]
[null,20,{"$f":"C26*IF(Calculations!$F$16=\"\",Calculations!$D$16,Calculations!$F$16)/(1-IF(Calculations!$F$17=\"\",Calculations!$D$17,Calculations!$F$17))/Conversions!$D$81","v":{"$error":"#VALUE!"}},{"$f":"D26*IF(Calculations!$F$16=\"\",Calculations!$D$16,Calculations!$F$16)/(1-IF(Calculations!$F$17=\"\",Calculations!$D$17,Calculations!$F$17))/Conversions!$D$81","v":{"$error":"#VALUE!"}},{"$f":"E26*IF(Calculations!$F$16=\"\",Calculations!$D$16,Calculations!$F$16)/(1-IF(Calculations!$F$17=\"\",Calculations!$D$17,Calculations!$F$17))/Conversions!$D$81","v":{"$error":"#VALUE!"}},{"$f":"F26*IF(Calculations!$F$16=\"\",Calculations!$D$16,Calculations!$F$16)/(1-IF(Calculations!$F$17=\"\",Calculations!$D$17,Calculations!$F$17))/Conversions!$D$81","v":{"$error":"#VALUE!"}},{"$f":"G26*IF(Calculations!$F$16=\"\",Calculations!$D$16,Calculations!$F$16)/(1-IF(Calculations!$F$17=\"\",Calculations!$D$17,Calculations!$F$17))/Conversions!$D$81","v":{"$error":"#VALUE!"}},{"$f":"H26*IF(Calculations!$F$16=\"\",Calculations!$D$16,Calculations!$F$16)/(1-IF(Calculations!$F$17=\"\",Calculations!$D$17,Calculations!$F$17))/Conversions!$D$81","v":{"$error":"#VALUE!"}},{"$f":"I26*IF(Calculations!$F$16=\"\",Calculations!$D$16,Calculations!$F$16)/(1-IF(Calculations!$F$17=\"\",Calculations!$D$17,Calculations!$F$17))/Conversions!$D$81","v":{"$error":"#VALUE!"}},{"$f":"J26*IF(Calculations!$F$16=\"\",Calculations!$D$16,Calculations!$F$16)/(1-IF(Calculations!$F$17=\"\",Calculations!$D$17,Calculations!$F$17))/Conversions!$D$81","v":{"$error":"#VALUE!"}},{"$f":"K26*IF(Calculations!$F$16=\"\",Calculations!$D$16,Calculations!$F$16)/(1-IF(Calculations!$F$17=\"\",Calculations!$D$17,Calculations!$F$17))/Conversions!$D$81","v":{"$error":"#VALUE!"}},{"$f":"L26*IF(Calculations!$F$16=\"\",Calculations!$D$16,Calculations!$F$16)/(1-IF(Calculations!$F$17=\"\",Calculations!$D$17,Calculations!$F$17))/Conversions!$D$81","v":{"$error":"#VALUE!"}},{"$error":"#VALUE!"},null,20,{"$f":"P26*Conversions!$K$59*IF(Calculations!$F$18=\"\",Calculations!$D$18,Calculations!$F$18)/Conversions!$D$81","v":{"$error":"#VALUE!"}},{"$f":"Q26*Conversions!$K$59*IF(Calculations!$F$18=\"\",Calculations!$D$18,Calculations!$F$18)/Conversions!$D$81","v":{"$error":"#VALUE!"}},{"$f":"R26*Conversions!$K$59*IF(Calculations!$F$18=\"\",Calculations!$D$18,Calculations!$F$18)/Conversions!$D$81","v":{"$error":"#VALUE!"}},{"$f":"S26*Conversions!$K$59*IF(Calculations!$F$18=\"\",Calculations!$D$18,Calculations!$F$18)/Conversions!$D$81","v":{"$error":"#VALUE!"}},{"$f":"T26*Conversions!$K$59*IF(Calculations!$F$18=\"\",Calculations!$D$18,Calculations!$F$18)/Conversions!$D$81","v":{"$error":"#VALUE!"}},{"$f":"U26*Conversions!$K$59*IF(Calculations!$F$18=\"\",Calculations!$D$18,Calculations!$F$18)/Conversions!$D$81","v":{"$error":"#VALUE!"}},{"$f":"V26*Conversions!$K$59*IF(Calculations!$F$18=\"\",Calculations!$D$18,Calculations!$F$18)/Conversions!$D$81","v":{"$error":"#VALUE!"}},{"$f":"W26*Conversions!$K$59*IF(Calculations!$F$18=\"\",Calculations!$D$18,Calculations!$F$18)/Conversions!$D$81","v":{"$error":"#VALUE!"}},{"$f":"X26*Conversions!$K$59*IF(Calculations!$F$18=\"\",Calculations!$D$18,Calculations!$F$18)/Conversions!$D$81","v":{"$error":"#VALUE!"}},{"$f":"Y26*Conversions!$K$59*IF(Calculations!$F$18=\"\",Calculations!$D$18,Calculations!$F$18)/Conversions!$D$81","v":{"$error":"#VALUE!"}},{"$error":"#VALUE!"},null,20,{"$error":"#VALUE!"},{"$error":"#VALUE!"},{"$error":"#VALUE!"},{"$error":"#VALUE!"},{"$error":"#VALUE!"},{"$error":"#VALUE!"},{"$error":"#VALUE!"},{"$error":"#VALUE!"},{"$error":"#VALUE!"},{"$error":"#VALUE!"},{"$error":"#VALUE!"},null,2032]
[null,"Total",{"$f":"SUM(C33:C52)","v":{"$error":"#VALUE!"}},{"$error":"#VALUE!"},{"$error":"#VALUE!"},{"$error":"#VALUE!"},{"$error":"#VALUE!"},{"$f":"SUM(H33:H52)","v":{"$error":"#VALUE!"}},{"$error":"#VALUE!"},{"$error":"#VALUE!"},{"$error":"#VALUE!"},{"$error":"#VALUE!"},{"$error":"#VALUE!"},null,null,{"$f":"SUM(P33:P52)","v":{"$error":"#VALUE!"}},{"$error":"#VALUE!"},{"$error":"#VALUE!"},{"$error":"#VALUE!"},{"$error":"#VALUE!"},{"$f":"SUM(U33:U52)","v":{"$error":"#VALUE!"}},{"$error":"#VALUE!"},{"$error":"#VALUE!"},{"$error":"#VALUE!"},{"$error":"#VALUE!"},{"$f":"SUM(P53:Y53)","v":{"$error":"#VALUE!"}},null,null,{"$f":"SUM(AC33:AC52)","v":{"$error":"#VALUE!"}},{"$error":"#VALUE!"},{"$error":"#VALUE!"},{"$error":"#VALUE!"},{"$error":"#VALUE!"},{"$f":"SUM(AH33:AH52)","v":{"$error":"#VALUE!"}},{"$error":"#VALUE!"},{"$error":"#VALUE!"},{"$error":"#VALUE!"},{"$error":"#VALUE!"},{"$f":"SUM(AC53:AL53)","v":{"$error":"#VALUE!"}}]
[]
[]
[]
[]
[null,"For Bar Plot"]
[null,"Baseline Emissions",null,null,{"$f":"Results!D23","v":""},null,null,null,{"$f":"Results!H23","v":""}]
[null,"Activity Emissions",null,null,{"$f":"Results!F23","v":""},null,null,null,{"$f":"Results!J23","v":0}]
[null,"Emission Reductions",null,null,{"$f":"Results!H23","v":""},null,null,null,{"$f":"Results!L23","v":0}]
[]
[null,"For Line Plot"]
[null,"Coordinates","Activity","Baseline",null,null,null,"Baseline"]
[null,0.75,{"$f":"E60+E61/100","v":{"$error":"#VALUE!"}},{"$f":"E59+E61/100","v":{"$error":"#VALUE!"}},null,null,null,{"$f":"I59+I61/100","v":{"$error":"#VALUE!"}}]
[null,1.25,{"$f":"E60+E61/100","v":{"$error":"#VALUE!"}},{"$f":"E59+E61/100","v":{"$error":"#VALUE!"}},null,null,null,{"$f":"I59+I61/100","v":{"$error":"#VALUE!"}}]

{"sheet":"Country Pick","index":10,"n_rows":131,"n_cols":9,"rows_kept":131,"cut":false,"hidden":true,"merged":[]}
["Manually Typed"]
["Country names","All Countries:","Cities from selected country",null,null,null,null,"Count",{"$f":"COUNTIF(E3:E131,1)","v":9}]
[{"$f":"INDEX(Countries,MATCH(B3,'Country Parameters'!$F$4:$F$198,0))","v":"Algeria"},"DZA",{"$f":"IF(OFFSET(WeatherData!L6,0,WeatherData!$J$2-1)=\"\",\"\",OFFSET(WeatherData!L6,0,WeatherData!$J$2-1))","v":"Addis Ababa-Bole"},null,{"$f":"IF(C3<>\"\",1,0)","v":1},{"$f":"MATCH(B3,'Country Parameters'!$F$4:$F$198,0)","v":3},null,null,{"$f":"MATCH(A3,Countries,0)","v":3}]
[{"$f":"INDEX(Countries,MATCH(B4,'Country Parameters'!$F$4:$F$198,0))","v":"Argentina"},"ARG",{"$f":"IF(OFFSET(WeatherData!L7,0,WeatherData!$J$2-1)=\"\",\"\",OFFSET(WeatherData!L7,0,WeatherData!$J$2-1))","v":"Awassa"},null,{"$f":"IF(C4<>\"\",1,0)","v":1},{"$f":"MATCH(B4,'Country Parameters'!$F$4:$F$198,0)","v":7},null,null,7]
[{"$f":"INDEX(Countries,MATCH(B5,'Country Parameters'!$F$4:$F$198,0))","v":"Australia"},"AUS",{"$f":"IF(OFFSET(WeatherData!L8,0,WeatherData!$J$2-1)=\"\",\"\",OFFSET(WeatherData!L8,0,WeatherData!$J$2-1))","v":"Bahar Dar"},null,1,{"$f":"MATCH(B5,'Country Parameters'!$F$4:$F$198,0)","v":9},null,null,9]
[{"$f":"INDEX(Countries,MATCH(B6,'Country Parameters'!$F$4:$F$198,0))","v":"Austria"},"AUT",{"$f":"IF(OFFSET(WeatherData!L9,0,WeatherData!$J$2-1)=\"\",\"\",OFFSET(WeatherData!L9,0,WeatherData!$J$2-1))","v":"Combolcha"},null,1,{"$f":"MATCH(B6,'Country Parameters'!$F$4:$F$198,0)","v":10},null,null,10]
[{"$f":"INDEX(Countries,MATCH(B7,'Country Parameters'!$F$4:$F$198,0))","v":"Bangladesh"},"BGD",{"$f":"IF(OFFSET(WeatherData!L10,0,WeatherData!$J$2-1)=\"\",\"\",OFFSET(WeatherData!L10,0,WeatherData!$J$2-1))","v":"Debre Marcos"},null,1,{"$f":"MATCH(B7,'Country Parameters'!$F$4:$F$198,0)","v":14},null,null,14]
[{"$f":"INDEX(Countries,MATCH(B8,'Country Parameters'!$F$4:$F$198,0))","v":"Belarus"},"BLR",{"$f":"IF(OFFSET(WeatherData!L11,0,WeatherData!$J$2-1)=\"\",\"\",OFFSET(WeatherData!L11,0,WeatherData!$J$2-1))","v":"Dire Dawa"},null,1,{"$f":"MATCH(B8,'Country Parameters'!$F$4:$F$198,0)","v":16},null,null,16]
[{"$f":"INDEX(Countries,MATCH(B9,'Country Parameters'!$F$4:$F$198,0))","v":"Belgium"},"BEL",{"$f":"IF(OFFSET(WeatherData!L12,0,WeatherData!$J$2-1)=\"\",\"\",OFFSET(WeatherData!L12,0,WeatherData!$J$2-1))","v":"Gondar"},null,1,{"$f":"MATCH(B9,'Country Parameters'!$F$4:$F$198,0)","v":17},null,null,17]
[{"$f":"INDEX(Countries,MATCH(B10,'Country Parameters'!$F$4:$F$198,0))","v":"Belize"},"BLZ",{"$f":"IF(OFFSET(WeatherData!L13,0,WeatherData!$J$2-1)=\"\",\"\",OFFSET(WeatherData!L13,0,WeatherData!$J$2-1))","v":"Jimma"},null,1,{"$f":"MATCH(B10,'Country Parameters'!$F$4:$F$198,0)","v":18},null,null,18]
[{"$f":"INDEX(Countries,MATCH(B11,'Country Parameters'!$F$4:$F$198,0))","v":"Bolivia"},"BOL",{"$f":"IF(OFFSET(WeatherData!L14,0,WeatherData!$J$2-1)=\"\",\"\",OFFSET(WeatherData!L14,0,WeatherData!$J$2-1))","v":"Metehara"},null,1,{"$f":"MATCH(B11,'Country Parameters'!$F$4:$F$198,0)","v":21},null,null,21]
[{"$f":"INDEX(Countries,MATCH(B12,'Country Parameters'!$F$4:$F$198,0))","v":"Bosnia and Herzegovina"},"BIH",{"$f":"IF(OFFSET(WeatherData!L15,0,WeatherData!$J$2-1)=\"\",\"\",OFFSET(WeatherData!L15,0,WeatherData!$J$2-1))","v":""},null,0,{"$f":"MATCH(B12,'Country Parameters'!$F$4:$F$198,0)","v":22},null,null,22]
[{"$f":"INDEX(Countries,MATCH(B13,'Country Parameters'!$F$4:$F$198,0))","v":"Brazil"},"BRA",{"$f":"IF(OFFSET(WeatherData!L16,0,WeatherData!$J$2-1)=\"\",\"\",OFFSET(WeatherData!L16,0,WeatherData!$J$2-1))","v":""},null,0,{"$f":"MATCH(B13,'Country Parameters'!$F$4:$F$198,0)","v":24},null,null,24]
[{"$f":"INDEX(Countries,MATCH(B14,'Country Parameters'!$F$4:$F$198,0))","v":"Brunei Darussalam"},"BRN",{"$f":"IF(OFFSET(WeatherData!L17,0,WeatherData!$J$2-1)=\"\",\"\",OFFSET(WeatherData!L17,0,WeatherData!$J$2-1))","v":""},null,0,{"$f":"MATCH(B14,'Country Parameters'!$F$4:$F$198,0)","v":25},null,null,25]
[{"$f":"INDEX(Countries,MATCH(B15,'Country Parameters'!$F$4:$F$198,0))","v":"Bulgaria"},"BGR",{"$f":"IF(OFFSET(WeatherData!L18,0,WeatherData!$J$2-1)=\"\",\"\",OFFSET(WeatherData!L18,0,WeatherData!$J$2-1))","v":""},null,0,{"$f":"MATCH(B15,'Country Parameters'!$F$4:$F$198,0)","v":26},null,null,26]
[{"$f":"INDEX(Countries,MATCH(B16,'Country Parameters'!$F$4:$F$198,0))","v":"Canada"},"CAN",{"$f":"IF(OFFSET(WeatherData!L19,0,WeatherData!$J$2-1)=\"\",\"\",OFFSET(WeatherData!L19,0,WeatherData!$J$2-1))","v":""},null,0,{"$f":"MATCH(B16,'Country Parameters'!$F$4:$F$198,0)","v":32},null,null,32]
[{"$f":"INDEX(Countries,MATCH(B17,'Country Parameters'!$F$4:$F$198,0))","v":"Chile"},"CHL",{"$f":"IF(OFFSET(WeatherData!L20,0,WeatherData!$J$2-1)=\"\",\"\",OFFSET(WeatherData!L20,0,WeatherData!$J$2-1))","v":""},null,0,{"$f":"MATCH(B17,'Country Parameters'!$F$4:$F$198,0)","v":36},null,null,36]
[{"$f":"INDEX(Countries,MATCH(B18,'Country Parameters'!$F$4:$F$198,0))","v":"China"},"CHN",{"$f":"IF(OFFSET(WeatherData!L21,0,WeatherData!$J$2-1)=\"\",\"\",OFFSET(WeatherData!L21,0,WeatherData!$J$2-1))","v":""},null,0,{"$f":"MATCH(B18,'Country Parameters'!$F$4:$F$198,0)","v":37},null,null,37]
[{"$f":"INDEX(Countries,MATCH(B19,'Country Parameters'!$F$4:$F$198,0))","v":"Colombia"},"COL",{"$f":"IF(OFFSET(WeatherData!L22,0,WeatherData!$J$2-1)=\"\",\"\",OFFSET(WeatherData!L22,0,WeatherData!$J$2-1))","v":""},null,0,{"$f":"MATCH(B19,'Country Parameters'!$F$4:$F$198,0)","v":38},null,null,38]
[{"$f":"INDEX(Countries,MATCH(B20,'Country Parameters'!$F$4:$F$198,0))","v":"Cuba"},"CUB",{"$f":"IF(OFFSET(WeatherData!L23,0,WeatherData!$J$2-1)=\"\",\"\",OFFSET(WeatherData!L23,0,WeatherData!$J$2-1))","v":""},null,0,{"$f":"MATCH(B20,'Country Parameters'!$F$4:$F$198,0)","v":45},null,null,45]
[{"$f":"INDEX(Countries,MATCH(B21,'Country Parameters'!$F$4:$F$198,0))","v":"Cyprus"},"CYP",{"$f":"IF(OFFSET(WeatherData!L24,0,WeatherData!$J$2-1)=\"\",\"\",OFFSET(WeatherData!L24,0,WeatherData!$J$2-1))","v":""},null,0,{"$f":"MATCH(B21,'Country Parameters'!$F$4:$F$198,0)","v":46},null,null,46]
[{"$f":"INDEX(Countries,MATCH(B22,'Country Parameters'!$F$4:$F$198,0))","v":"Czech Republic"},"CZE",{"$f":"IF(OFFSET(WeatherData!L25,0,WeatherData!$J$2-1)=\"\",\"\",OFFSET(WeatherData!L25,0,WeatherData!$J$2-1))","v":""},null,0,{"$f":"MATCH(B22,'Country Parameters'!$F$4:$F$198,0)","v":47},null,null,47]
[{"$f":"INDEX(Countries,MATCH(B23,'Country Parameters'!$F$4:$F$198,0))","v":"Denmark"},"DNK",{"$f":"IF(OFFSET(WeatherData!L26,0,WeatherData!$J$2-1)=\"\",\"\",OFFSET(WeatherData!L26,0,WeatherData!$J$2-1))","v":""},null,0,{"$f":"MATCH(B23,'Country Parameters'!$F$4:$F$198,0)","v":48},null,null,48]
[{"$f":"INDEX(Countries,MATCH(B24,'Country Parameters'!$F$4:$F$198,0))","v":"Ecuador"},"ECU",{"$f":"IF(OFFSET(WeatherData!L27,0,WeatherData!$J$2-1)=\"\",\"\",OFFSET(WeatherData!L27,0,WeatherData!$J$2-1))","v":""},null,0,{"$f":"MATCH(B24,'Country Parameters'!$F$4:$F$198,0)","v":52},null,null,52]
[{"$f":"INDEX(Countries,MATCH(B25,'Country Parameters'!$F$4:$F$198,0))","v":"Egypt"},"EGY",{"$f":"IF(OFFSET(WeatherData!L28,0,WeatherData!$J$2-1)=\"\",\"\",OFFSET(WeatherData!L28,0,WeatherData!$J$2-1))","v":""},null,0,{"$f":"MATCH(B25,'Country Parameters'!$F$4:$F$198,0)","v":53},null,null,53]
[{"$f":"INDEX(Countries,MATCH(B26,'Country Parameters'!$F$4:$F$198,0))","v":"El Salvador"},"SLV",{"$f":"IF(OFFSET(WeatherData!L29,0,WeatherData!$J$2-1)=\"\",\"\",OFFSET(WeatherData!L29,0,WeatherData!$J$2-1))","v":""},null,0,{"$f":"MATCH(B26,'Country Parameters'!$F$4:$F$198,0)","v":54},null,null,54]
[{"$f":"INDEX(Countries,MATCH(B27,'Country Parameters'!$F$4:$F$198,0))","v":"Ethiopia"},"ETH",{"$f":"IF(OFFSET(WeatherData!L30,0,WeatherData!$J$2-1)=\"\",\"\",OFFSET(WeatherData!L30,0,WeatherData!$J$2-1))","v":""},null,0,{"$f":"MATCH(B27,'Country Parameters'!$F$4:$F$198,0)","v":58},null,null,58]
[{"$f":"INDEX(Countries,MATCH(B28,'Country Parameters'!$F$4:$F$198,0))","v":"Fiji"},"FJI",{"$f":"IF(OFFSET(WeatherData!L31,0,WeatherData!$J$2-1)=\"\",\"\",OFFSET(WeatherData!L31,0,WeatherData!$J$2-1))","v":""},null,0,{"$f":"MATCH(B28,'Country Parameters'!$F$4:$F$198,0)","v":59},null,null,59]
[{"$f":"INDEX(Countries,MATCH(B29,'Country Parameters'!$F$4:$F$198,0))","v":"Finland"},"FIN",{"$f":"IF(OFFSET(WeatherData!L32,0,WeatherData!$J$2-1)=\"\",\"\",OFFSET(WeatherData!L32,0,WeatherData!$J$2-1))","v":""},null,0,{"$f":"MATCH(B29,'Country Parameters'!$F$4:$F$198,0)","v":60},null,null,60]
[{"$f":"INDEX(Countries,MATCH(B30,'Country Parameters'!$F$4:$F$198,0))","v":"France"},"FRA",{"$f":"IF(OFFSET(WeatherData!L33,0,WeatherData!$J$2-1)=\"\",\"\",OFFSET(WeatherData!L33,0,WeatherData!$J$2-1))","v":""},null,0,{"$f":"MATCH(B30,'Country Parameters'!$F$4:$F$198,0)","v":61},null,null,61]
[{"$f":"INDEX(Countries,MATCH(B31,'Country Parameters'!$F$4:$F$198,0))","v":"Germany"},"DEU",{"$f":"IF(OFFSET(WeatherData!L34,0,WeatherData!$J$2-1)=\"\",\"\",OFFSET(WeatherData!L34,0,WeatherData!$J$2-1))","v":""},null,0,{"$f":"MATCH(B31,'Country Parameters'!$F$4:$F$198,0)","v":65},null,null,65]
[{"$f":"INDEX(Countries,MATCH(B32,'Country Parameters'!$F$4:$F$198,0))","v":"Ghana"},"GHA",{"$f":"IF(OFFSET(WeatherData!L35,0,WeatherData!$J$2-1)=\"\",\"\",OFFSET(WeatherData!L35,0,WeatherData!$J$2-1))","v":""},null,0,{"$f":"MATCH(B32,'Country Parameters'!$F$4:$F$198,0)","v":66},null,null,66]
[{"$f":"INDEX(Countries,MATCH(B33,'Country Parameters'!$F$4:$F$198,0))","v":"Greece"},"GRC",{"$f":"IF(OFFSET(WeatherData!L36,0,WeatherData!$J$2-1)=\"\",\"\",OFFSET(WeatherData!L36,0,WeatherData!$J$2-1))","v":""},null,0,{"$f":"MATCH(B33,'Country Parameters'!$F$4:$F$198,0)","v":67},null,null,67]
[{"$f":"INDEX(Countries,MATCH(B34,'Country Parameters'!$F$4:$F$198,0))","v":"Guatemala"},"GTM",{"$f":"IF(OFFSET(WeatherData!L38,0,WeatherData!$J$2-1)=\"\",\"\",OFFSET(WeatherData!L38,0,WeatherData!$J$2-1))","v":""},null,0,{"$f":"MATCH(B34,'Country Parameters'!$F$4:$F$198,0)","v":69},null,null,69]
[{"$f":"INDEX(Countries,MATCH(B35,'Country Parameters'!$F$4:$F$198,0))","v":"Honduras"},"HND",{"$f":"IF(OFFSET(WeatherData!L39,0,WeatherData!$J$2-1)=\"\",\"\",OFFSET(WeatherData!L39,0,WeatherData!$J$2-1))","v":""},null,0,{"$f":"MATCH(B35,'Country Parameters'!$F$4:$F$198,0)","v":75},null,null,{"$f":"MATCH(A35,Countries,0)","v":75}]
[{"$f":"INDEX(Countries,MATCH(B36,'Country Parameters'!$F$4:$F$198,0))","v":"Hungary"},"HUN",{"$f":"IF(OFFSET(WeatherData!L40,0,WeatherData!$J$2-1)=\"\",\"\",OFFSET(WeatherData!L40,0,WeatherData!$J$2-1))","v":""},null,0,{"$f":"MATCH(B36,'Country Parameters'!$F$4:$F$198,0)","v":76},null,null,76]
[{"$f":"INDEX(Countries,MATCH(B37,'Country Parameters'!$F$4:$F$198,0))","v":"Iceland"},"ISL",{"$f":"IF(OFFSET(WeatherData!L41,0,WeatherData!$J$2-1)=\"\",\"\",OFFSET(WeatherData!L41,0,WeatherData!$J$2-1))","v":""},null,0,{"$f":"MATCH(B37,'Country Parameters'!$F$4:$F$198,0)","v":77},null,null,77]
[{"$f":"INDEX(Countries,MATCH(B38,'Country Parameters'!$F$4:$F$198,0))","v":"India"},"IND",{"$f":"IF(OFFSET(WeatherData!L42,0,WeatherData!$J$2-1)=\"\",\"\",OFFSET(WeatherData!L42,0,WeatherData!$J$2-1))","v":""},null,0,{"$f":"MATCH(B38,'Country Parameters'!$F$4:$F$198,0)","v":78},null,null,78]
[{"$f":"INDEX(Countries,MATCH(B39,'Country Parameters'!$F$4:$F$198,0))","v":"Iran"},"IRN",{"$f":"IF(OFFSET(WeatherData!L43,0,WeatherData!$J$2-1)=\"\",\"\",OFFSET(WeatherData!L43,0,WeatherData!$J$2-1))","v":""},null,0,{"$f":"MATCH(B39,'Country Parameters'!$F$4:$F$198,0)","v":80},null,null,80]
[{"$f":"INDEX(Countries,MATCH(B40,'Country Parameters'!$F$4:$F$198,0))","v":"Ireland"},"IRL",{"$f":"IF(OFFSET(WeatherData!L44,0,WeatherData!$J$2-1)=\"\",\"\",OFFSET(WeatherData!L44,0,WeatherData!$J$2-1))","v":""},null,0,{"$f":"MATCH(B40,'Country Parameters'!$F$4:$F$198,0)","v":82},null,null,82]
[{"$f":"INDEX(Countries,MATCH(B41,'Country Parameters'!$F$4:$F$198,0))","v":"Israel"},"ISR",{"$f":"IF(OFFSET(WeatherData!L45,0,WeatherData!$J$2-1)=\"\",\"\",OFFSET(WeatherData!L45,0,WeatherData!$J$2-1))","v":""},null,0,{"$f":"MATCH(B41,'Country Parameters'!$F$4:$F$198,0)","v":83},null,null,83]
[{"$f":"INDEX(Countries,MATCH(B42,'Country Parameters'!$F$4:$F$198,0))","v":"Italy"},"ITA",{"$f":"IF(OFFSET(WeatherData!L46,0,WeatherData!$J$2-1)=\"\",\"\",OFFSET(WeatherData!L46,0,WeatherData!$J$2-1))","v":""},null,0,{"$f":"MATCH(B42,'Country Parameters'!$F$4:$F$198,0)","v":84},null,null,84]
[{"$f":"INDEX(Countries,MATCH(B43,'Country Parameters'!$F$4:$F$198,0))","v":"Japan"},"JPN",{"$f":"IF(OFFSET(WeatherData!L47,0,WeatherData!$J$2-1)=\"\",\"\",OFFSET(WeatherData!L47,0,WeatherData!$J$2-1))","v":""},null,0,{"$f":"MATCH(B43,'Country Parameters'!$F$4:$F$198,0)","v":86},null,null,86]
[{"$f":"INDEX(Countries,MATCH(B44,'Country Parameters'!$F$4:$F$198,0))","v":"Kazakhstan"},"KAZ",{"$f":"IF(OFFSET(WeatherData!L48,0,WeatherData!$J$2-1)=\"\",\"\",OFFSET(WeatherData!L48,0,WeatherData!$J$2-1))","v":""},null,0,{"$f":"MATCH(B44,'Country Parameters'!$F$4:$F$198,0)","v":88},null,null,88]
[{"$f":"INDEX(Countries,MATCH(B45,'Country Parameters'!$F$4:$F$198,0))","v":"Kenya"},"KEN",{"$f":"IF(OFFSET(WeatherData!L49,0,WeatherData!$J$2-1)=\"\",\"\",OFFSET(WeatherData!L49,0,WeatherData!$J$2-1))","v":""},null,0,{"$f":"MATCH(B45,'Country Parameters'!$F$4:$F$198,0)","v":89},null,null,89]
[{"$f":"INDEX(Countries,MATCH(B46,'Country Parameters'!$F$4:$F$198,0))","v":"Korea, North"},"PRK",{"$f":"IF(OFFSET(WeatherData!L50,0,WeatherData!$J$2-1)=\"\",\"\",OFFSET(WeatherData!L50,0,WeatherData!$J$2-1))","v":""},null,0,{"$f":"MATCH(B46,'Country Parameters'!$F$4:$F$198,0)","v":91},null,null,91]
[{"$f":"INDEX(Countries,MATCH(B47,'Country Parameters'!$F$4:$F$198,0))","v":"Korea, South"},"KOR",{"$f":"IF(OFFSET(WeatherData!L51,0,WeatherData!$J$2-1)=\"\",\"\",OFFSET(WeatherData!L51,0,WeatherData!$J$2-1))","v":""},null,0,{"$f":"MATCH(B47,'Country Parameters'!$F$4:$F$198,0)","v":92},null,null,92]
[{"$f":"INDEX(Countries,MATCH(B48,'Country Parameters'!$F$4:$F$198,0))","v":"Kuwait"},"KWT",{"$f":"IF(OFFSET(WeatherData!L52,0,WeatherData!$J$2-1)=\"\",\"\",OFFSET(WeatherData!L52,0,WeatherData!$J$2-1))","v":""},null,0,{"$f":"MATCH(B48,'Country Parameters'!$F$4:$F$198,0)","v":94},null,null,94]
[{"$f":"INDEX(Countries,MATCH(B49,'Country Parameters'!$F$4:$F$198,0))","v":"Libya"},"LBY",{"$f":"IF(OFFSET(WeatherData!L53,0,WeatherData!$J$2-1)=\"\",\"\",OFFSET(WeatherData!L53,0,WeatherData!$J$2-1))","v":""},null,0,{"$f":"MATCH(B49,'Country Parameters'!$F$4:$F$198,0)","v":101},null,null,101]
[{"$f":"INDEX(Countries,MATCH(B50,'Country Parameters'!$F$4:$F$198,0))","v":"Lithuania"},"LTU",{"$f":"IF(OFFSET(WeatherData!L54,0,WeatherData!$J$2-1)=\"\",\"\",OFFSET(WeatherData!L54,0,WeatherData!$J$2-1))","v":""},null,0,{"$f":"MATCH(B50,'Country Parameters'!$F$4:$F$198,0)","v":103},null,null,103]
[{"$f":"INDEX(Countries,MATCH(B51,'Country Parameters'!$F$4:$F$198,0))","v":"Madagascar"},"MDG",{"$f":"IF(OFFSET(WeatherData!L56,0,WeatherData!$J$2-1)=\"\",\"\",OFFSET(WeatherData!L56,0,WeatherData!$J$2-1))","v":""},null,0,{"$f":"MATCH(B51,'Country Parameters'!$F$4:$F$198,0)","v":106},null,null,106]
[{"$f":"INDEX(Countries,MATCH(B52,'Country Parameters'!$F$4:$F$198,0))","v":"Malaysia"},"MYS",{"$f":"IF(OFFSET(WeatherData!L57,0,WeatherData!$J$2-1)=\"\",\"\",OFFSET(WeatherData!L57,0,WeatherData!$J$2-1))","v":""},null,0,{"$f":"MATCH(B52,'Country Parameters'!$F$4:$F$198,0)","v":108},null,null,108]
[{"$f":"INDEX(Countries,MATCH(B53,'Country Parameters'!$F$4:$F$198,0))","v":"Maldives"},"MDV",{"$f":"IF(OFFSET(WeatherData!L58,0,WeatherData!$J$2-1)=\"\",\"\",OFFSET(WeatherData!L58,0,WeatherData!$J$2-1))","v":""},null,0,{"$f":"MATCH(B53,'Country Parameters'!$F$4:$F$198,0)","v":109},null,null,109]
[{"$f":"INDEX(Countries,MATCH(B54,'Country Parameters'!$F$4:$F$198,0))","v":"Marshall Islands"},"MHL",{"$f":"IF(OFFSET(WeatherData!L59,0,WeatherData!$J$2-1)=\"\",\"\",OFFSET(WeatherData!L59,0,WeatherData!$J$2-1))","v":""},null,0,{"$f":"MATCH(B54,'Country Parameters'!$F$4:$F$198,0)","v":112},null,null,112]
[{"$f":"INDEX(Countries,MATCH(B55,'Country Parameters'!$F$4:$F$198,0))","v":"Mexico"},"MEX",{"$f":"IF(OFFSET(WeatherData!L61,0,WeatherData!$J$2-1)=\"\",\"\",OFFSET(WeatherData!L61,0,WeatherData!$J$2-1))","v":""},null,0,{"$f":"MATCH(B55,'Country Parameters'!$F$4:$F$198,0)","v":115},null,null,115]
[{"$f":"INDEX(Countries,MATCH(B56,'Country Parameters'!$F$4:$F$198,0))","v":"Mongolia"},"MNG",{"$f":"IF(OFFSET(WeatherData!L63,0,WeatherData!$J$2-1)=\"\",\"\",OFFSET(WeatherData!L63,0,WeatherData!$J$2-1))","v":""},null,0,{"$f":"MATCH(B56,'Country Parameters'!$F$4:$F$198,0)","v":119},null,null,119]
[{"$f":"INDEX(Countries,MATCH(B57,'Country Parameters'!$F$4:$F$198,0))","v":"Morocco"},"MAR",{"$f":"IF(OFFSET(WeatherData!L64,0,WeatherData!$J$2-1)=\"\",\"\",OFFSET(WeatherData!L64,0,WeatherData!$J$2-1))","v":""},null,0,{"$f":"MATCH(B57,'Country Parameters'!$F$4:$F$198,0)","v":121},null,null,121]
[{"$f":"INDEX(Countries,MATCH(B58,'Country Parameters'!$F$4:$F$198,0))","v":"Nepal"},"NPL",{"$f":"IF(OFFSET(WeatherData!L65,0,WeatherData!$J$2-1)=\"\",\"\",OFFSET(WeatherData!L65,0,WeatherData!$J$2-1))","v":""},null,0,{"$f":"MATCH(B58,'Country Parameters'!$F$4:$F$198,0)","v":125},null,null,125]
[{"$f":"INDEX(Countries,MATCH(B59,'Country Parameters'!$F$4:$F$198,0))","v":"Netherlands"},"NLD",{"$f":"IF(OFFSET(WeatherData!L66,0,WeatherData!$J$2-1)=\"\",\"\",OFFSET(WeatherData!L66,0,WeatherData!$J$2-1))","v":""},null,0,{"$f":"MATCH(B59,'Country Parameters'!$F$4:$F$198,0)","v":126},null,null,126]
[{"$f":"INDEX(Countries,MATCH(B60,'Country Parameters'!$F$4:$F$198,0))","v":"New Zealand"},"NZL",{"$f":"IF(OFFSET(WeatherData!L67,0,WeatherData!$J$2-1)=\"\",\"\",OFFSET(WeatherData!L67,0,WeatherData!$J$2-1))","v":""},null,0,{"$f":"MATCH(B60,'Country Parameters'!$F$4:$F$198,0)","v":127},null,null,127]
[{"$f":"INDEX(Countries,MATCH(B61,'Country Parameters'!$F$4:$F$198,0))","v":"Nicaragua"},"NIC",{"$f":"IF(OFFSET(WeatherData!L68,0,WeatherData!$J$2-1)=\"\",\"\",OFFSET(WeatherData!L68,0,WeatherData!$J$2-1))","v":""},null,0,{"$f":"MATCH(B61,'Country Parameters'!$F$4:$F$198,0)","v":128},null,null,128]
[{"$f":"INDEX(Countries,MATCH(B62,'Country Parameters'!$F$4:$F$198,0))","v":"Norway"},"NOR",{"$f":"IF(OFFSET(WeatherData!L69,0,WeatherData!$J$2-1)=\"\",\"\",OFFSET(WeatherData!L69,0,WeatherData!$J$2-1))","v":""},null,0,{"$f":"MATCH(B62,'Country Parameters'!$F$4:$F$198,0)","v":131},null,null,131]
[{"$f":"INDEX(Countries,MATCH(B63,'Country Parameters'!$F$4:$F$198,0))","v":"Pakistan"},"PAK",{"$f":"IF(OFFSET(WeatherData!L70,0,WeatherData!$J$2-1)=\"\",\"\",OFFSET(WeatherData!L70,0,WeatherData!$J$2-1))","v":""},null,0,{"$f":"MATCH(B63,'Country Parameters'!$F$4:$F$198,0)","v":133},null,null,133]
[{"$f":"INDEX(Countries,MATCH(B64,'Country Parameters'!$F$4:$F$198,0))","v":"Palau"},"PLW",{"$f":"IF(OFFSET(WeatherData!L71,0,WeatherData!$J$2-1)=\"\",\"\",OFFSET(WeatherData!L71,0,WeatherData!$J$2-1))","v":""},null,{"$f":"IF(C64<>\"\",1,0)","v":0},{"$f":"MATCH(B64,'Country Parameters'!$F$4:$F$198,0)","v":134},null,null,134]
[{"$f":"INDEX(Countries,MATCH(B65,'Country Parameters'!$F$4:$F$198,0))","v":"Paraguay"},"PRY",{"$f":"IF(OFFSET(WeatherData!L72,0,WeatherData!$J$2-1)=\"\",\"\",OFFSET(WeatherData!L72,0,WeatherData!$J$2-1))","v":""},null,0,{"$f":"MATCH(B65,'Country Parameters'!$F$4:$F$198,0)","v":137},null,null,137]
[{"$f":"INDEX(Countries,MATCH(B66,'Country Parameters'!$F$4:$F$198,0))","v":"Peru"},"PER",{"$f":"IF(OFFSET(WeatherData!L73,0,WeatherData!$J$2-1)=\"\",\"\",OFFSET(WeatherData!L73,0,WeatherData!$J$2-1))","v":""},null,0,{"$f":"MATCH(B66,'Country Parameters'!$F$4:$F$198,0)","v":138},null,null,138]
[{"$f":"INDEX(Countries,MATCH(B67,'Country Parameters'!$F$4:$F$198,0))","v":"Philippines"},"PHL",{"$f":"IF(OFFSET(WeatherData!L74,0,WeatherData!$J$2-1)=\"\",\"\",OFFSET(WeatherData!L74,0,WeatherData!$J$2-1))","v":""},null,0,{"$f":"MATCH(B67,'Country Parameters'!$F$4:$F$198,0)","v":139},null,null,{"$f":"MATCH(A67,Countries,0)","v":139}]
[{"$f":"INDEX(Countries,MATCH(B68,'Country Parameters'!$F$4:$F$198,0))","v":"Poland"},"POL",{"$f":"IF(OFFSET(WeatherData!L75,0,WeatherData!$J$2-1)=\"\",\"\",OFFSET(WeatherData!L75,0,WeatherData!$J$2-1))","v":""},null,0,{"$f":"MATCH(B68,'Country Parameters'!$F$4:$F$198,0)","v":140},null,null,140]
[{"$f":"INDEX(Countries,MATCH(B69,'Country Parameters'!$F$4:$F$198,0))","v":"Portugal"},"PRT",{"$f":"IF(OFFSET(WeatherData!L76,0,WeatherData!$J$2-1)=\"\",\"\",OFFSET(WeatherData!L76,0,WeatherData!$J$2-1))","v":""},null,0,{"$f":"MATCH(B69,'Country Parameters'!$F$4:$F$198,0)","v":141},null,null,141]
[{"$f":"INDEX(Countries,MATCH(B70,'Country Parameters'!$F$4:$F$198,0))","v":"Romania"},"ROU",{"$f":"IF(OFFSET(WeatherData!L78,0,WeatherData!$J$2-1)=\"\",\"\",OFFSET(WeatherData!L78,0,WeatherData!$J$2-1))","v":""},null,0,{"$f":"MATCH(B70,'Country Parameters'!$F$4:$F$198,0)","v":143},null,null,143]
[{"$f":"INDEX(Countries,MATCH(B71,'Country Parameters'!$F$4:$F$198,0))","v":"Russia"},"RUS",{"$f":"IF(OFFSET(WeatherData!L79,0,WeatherData!$J$2-1)=\"\",\"\",OFFSET(WeatherData!L79,0,WeatherData!$J$2-1))","v":""},null,0,{"$f":"MATCH(B71,'Country Parameters'!$F$4:$F$198,0)","v":144},null,null,144]
[{"$f":"INDEX(Countries,MATCH(B72,'Country Parameters'!$F$4:$F$198,0))","v":"Saudi Arabia"},"SAU",{"$f":"IF(OFFSET(WeatherData!L80,0,WeatherData!$J$2-1)=\"\",\"\",OFFSET(WeatherData!L80,0,WeatherData!$J$2-1))","v":""},null,0,{"$f":"MATCH(B72,'Country Parameters'!$F$4:$F$198,0)","v":152},null,null,152]
[{"$f":"INDEX(Countries,MATCH(B73,'Country Parameters'!$F$4:$F$198,0))","v":"Senegal"},"SEN",{"$f":"IF(OFFSET(WeatherData!L81,0,WeatherData!$J$2-1)=\"\",\"\",OFFSET(WeatherData!L81,0,WeatherData!$J$2-1))","v":""},null,0,{"$f":"MATCH(B73,'Country Parameters'!$F$4:$F$198,0)","v":153},null,null,153]
[{"$f":"INDEX(Countries,MATCH(B74,'Country Parameters'!$F$4:$F$198,0))","v":"Serbia"},"SRB",{"$f":"IF(OFFSET(WeatherData!L82,0,WeatherData!$J$2-1)=\"\",\"\",OFFSET(WeatherData!L82,0,WeatherData!$J$2-1))","v":""},null,0,{"$f":"MATCH(B74,'Country Parameters'!$F$4:$F$198,0)","v":154},null,null,154]
[{"$f":"INDEX(Countries,MATCH(B75,'Country Parameters'!$F$4:$F$198,0))","v":"Singapore"},"SGP",{"$f":"IF(OFFSET(WeatherData!L83,0,WeatherData!$J$2-1)=\"\",\"\",OFFSET(WeatherData!L83,0,WeatherData!$J$2-1))","v":""},null,0,{"$f":"MATCH(B75,'Country Parameters'!$F$4:$F$198,0)","v":157},null,null,157]
[{"$f":"INDEX(Countries,MATCH(B76,'Country Parameters'!$F$4:$F$198,0))","v":"Slovakia"},"SVK",{"$f":"IF(OFFSET(WeatherData!L84,0,WeatherData!$J$2-1)=\"\",\"\",OFFSET(WeatherData!L84,0,WeatherData!$J$2-1))","v":""},null,0,{"$f":"MATCH(B76,'Country Parameters'!$F$4:$F$198,0)","v":158},null,null,158]
[{"$f":"INDEX(Countries,MATCH(B77,'Country Parameters'!$F$4:$F$198,0))","v":"Slovenia"},"SVN",{"$f":"IF(OFFSET(WeatherData!L85,0,WeatherData!$J$2-1)=\"\",\"\",OFFSET(WeatherData!L85,0,WeatherData!$J$2-1))","v":""},null,0,{"$f":"MATCH(B77,'Country Parameters'!$F$4:$F$198,0)","v":159},null,null,159]
[{"$f":"INDEX(Countries,MATCH(B78,'Country Parameters'!$F$4:$F$198,0))","v":"South Africa"},"ZAF",{"$f":"IF(OFFSET(WeatherData!L86,0,WeatherData!$J$2-1)=\"\",\"\",OFFSET(WeatherData!L86,0,WeatherData!$J$2-1))","v":""},null,0,{"$f":"MATCH(B78,'Country Parameters'!$F$4:$F$198,0)","v":162},null,null,162]
[{"$f":"INDEX(Countries,MATCH(B79,'Country Parameters'!$F$4:$F$198,0))","v":"Spain"},"ESP",{"$f":"IF(OFFSET(WeatherData!L87,0,WeatherData!$J$2-1)=\"\",\"\",OFFSET(WeatherData!L87,0,WeatherData!$J$2-1))","v":""},null,0,{"$f":"MATCH(B79,'Country Parameters'!$F$4:$F$198,0)","v":164},null,null,164]
[{"$f":"INDEX(Countries,MATCH(B80,'Country Parameters'!$F$4:$F$198,0))","v":"Sri Lanka"},"LKA",{"$f":"IF(OFFSET(WeatherData!L88,0,WeatherData!$J$2-1)=\"\",\"\",OFFSET(WeatherData!L88,0,WeatherData!$J$2-1))","v":""},null,0,{"$f":"MATCH(B80,'Country Parameters'!$F$4:$F$198,0)","v":165},null,null,165]
[{"$f":"INDEX(Countries,MATCH(B81,'Country Parameters'!$F$4:$F$198,0))","v":"Sweden"},"SWE",{"$f":"IF(OFFSET(WeatherData!L89,0,WeatherData!$J$2-1)=\"\",\"\",OFFSET(WeatherData!L89,0,WeatherData!$J$2-1))","v":""},null,0,{"$f":"MATCH(B81,'Country Parameters'!$F$4:$F$198,0)","v":169},null,null,169]
[{"$f":"INDEX(Countries,MATCH(B82,'Country Parameters'!$F$4:$F$198,0))","v":"Switzerland"},"CHE",{"$f":"IF(OFFSET(WeatherData!L90,0,WeatherData!$J$2-1)=\"\",\"\",OFFSET(WeatherData!L90,0,WeatherData!$J$2-1))","v":""},null,0,{"$f":"MATCH(B82,'Country Parameters'!$F$4:$F$198,0)","v":170},null,null,170]
[{"$f":"INDEX(Countries,MATCH(B83,'Country Parameters'!$F$4:$F$198,0))","v":"Syria"},"SYR",{"$f":"IF(OFFSET(WeatherData!L91,0,WeatherData!$J$2-1)=\"\",\"\",OFFSET(WeatherData!L91,0,WeatherData!$J$2-1))","v":""},null,0,{"$f":"MATCH(B83,'Country Parameters'!$F$4:$F$198,0)","v":171},null,null,171]
[{"$f":"INDEX(Countries,MATCH(B84,'Country Parameters'!$F$4:$F$198,0))","v":"Thailand"},"THA",{"$f":"IF(OFFSET(WeatherData!L93,0,WeatherData!$J$2-1)=\"\",\"\",OFFSET(WeatherData!L93,0,WeatherData!$J$2-1))","v":""},null,0,{"$f":"MATCH(B84,'Country Parameters'!$F$4:$F$198,0)","v":174},null,null,174]
[{"$f":"INDEX(Countries,MATCH(B85,'Country Parameters'!$F$4:$F$198,0))","v":"Tunisia"},"TUN",{"$f":"IF(OFFSET(WeatherData!L94,0,WeatherData!$J$2-1)=\"\",\"\",OFFSET(WeatherData!L94,0,WeatherData!$J$2-1))","v":""},null,0,{"$f":"MATCH(B85,'Country Parameters'!$F$4:$F$198,0)","v":179},null,null,179]
[{"$f":"INDEX(Countries,MATCH(B86,'Country Parameters'!$F$4:$F$198,0))","v":"Turkey"},"TUR",{"$f":"IF(OFFSET(WeatherData!L95,0,WeatherData!$J$2-1)=\"\",\"\",OFFSET(WeatherData!L95,0,WeatherData!$J$2-1))","v":""},null,0,{"$f":"MATCH(B86,'Country Parameters'!$F$4:$F$198,0)","v":180},null,null,180]
[{"$f":"INDEX(Countries,MATCH(B87,'Country Parameters'!$F$4:$F$198,0))","v":"Ukraine"},"UKR",{"$f":"IF(OFFSET(WeatherData!L96,0,WeatherData!$J$2-1)=\"\",\"\",OFFSET(WeatherData!L96,0,WeatherData!$J$2-1))","v":""},null,0,{"$f":"MATCH(B87,'Country Parameters'!$F$4:$F$198,0)","v":184},null,null,184]
[{"$f":"INDEX(Countries,MATCH(B88,'Country Parameters'!$F$4:$F$198,0))","v":"United Arab Emirates"},"ARE",{"$f":"IF(OFFSET(WeatherData!L97,0,WeatherData!$J$2-1)=\"\",\"\",OFFSET(WeatherData!L97,0,WeatherData!$J$2-1))","v":""},null,0,{"$f":"MATCH(B88,'Country Parameters'!$F$4:$F$198,0)","v":185},null,null,185]
[{"$f":"INDEX(Countries,MATCH(B89,'Country Parameters'!$F$4:$F$198,0))","v":"United Kingdom"},"GBR",{"$f":"IF(OFFSET(WeatherData!L98,0,WeatherData!$J$2-1)=\"\",\"\",OFFSET(WeatherData!L98,0,WeatherData!$J$2-1))","v":""},null,0,{"$f":"MATCH(B89,'Country Parameters'!$F$4:$F$198,0)","v":186},null,null,186]
[{"$f":"INDEX(Countries,MATCH(B90,'Country Parameters'!$F$4:$F$198,0))","v":"United States"},"USA",{"$f":"IF(OFFSET(WeatherData!L99,0,WeatherData!$J$2-1)=\"\",\"\",OFFSET(WeatherData!L99,0,WeatherData!$J$2-1))","v":""},null,0,{"$f":"MATCH(B90,'Country Parameters'!$F$4:$F$198,0)","v":187},null,null,187]
[{"$f":"INDEX(Countries,MATCH(B91,'Country Parameters'!$F$4:$F$198,0))","v":"Uruguay"},"URY",{"$f":"IF(OFFSET(WeatherData!L100,0,WeatherData!$J$2-1)=\"\",\"\",OFFSET(WeatherData!L100,0,WeatherData!$J$2-1))","v":""},null,0,{"$f":"MATCH(B91,'Country Parameters'!$F$4:$F$198,0)","v":188},null,null,188]
[{"$f":"INDEX(Countries,MATCH(B92,'Country Parameters'!$F$4:$F$198,0))","v":"Uzbekistan"},"UZB",{"$f":"IF(OFFSET(WeatherData!L101,0,WeatherData!$J$2-1)=\"\",\"\",OFFSET(WeatherData!L101,0,WeatherData!$J$2-1))","v":""},null,0,{"$f":"MATCH(B92,'Country Parameters'!$F$4:$F$198,0)","v":189},null,null,189]
[{"$f":"INDEX(Countries,MATCH(B93,'Country Parameters'!$F$4:$F$198,0))","v":"Venezuela"},"VEN",{"$f":"IF(OFFSET(WeatherData!L102,0,WeatherData!$J$2-1)=\"\",\"\",OFFSET(WeatherData!L102,0,WeatherData!$J$2-1))","v":""},null,0,{"$f":"MATCH(B93,'Country Parameters'!$F$4:$F$198,0)","v":191},null,null,191]
[{"$f":"INDEX(Countries,MATCH(B94,'Country Parameters'!$F$4:$F$198,0))","v":"Vietnam"},"VNM",{"$f":"IF(OFFSET(WeatherData!L103,0,WeatherData!$J$2-1)=\"\",\"\",OFFSET(WeatherData!L103,0,WeatherData!$J$2-1))","v":""},null,0,{"$f":"MATCH(B94,'Country Parameters'!$F$4:$F$198,0)","v":192},null,null,192]
[{"$f":"INDEX(Countries,MATCH(B95,'Country Parameters'!$F$4:$F$198,0))","v":"Zimbabwe"},"ZWE",{"$f":"IF(OFFSET(WeatherData!L105,0,WeatherData!$J$2-1)=\"\",\"\",OFFSET(WeatherData!L105,0,WeatherData!$J$2-1))","v":""},null,0,{"$f":"MATCH(B95,'Country Parameters'!$F$4:$F$198,0)","v":195},null,null,195]
[null,null,{"$f":"IF(OFFSET(WeatherData!L106,0,WeatherData!$J$2-1)=\"\",\"\",OFFSET(WeatherData!L106,0,WeatherData!$J$2-1))","v":""},null,0]
[null,null,{"$f":"IF(OFFSET(WeatherData!L107,0,WeatherData!$J$2-1)=\"\",\"\",OFFSET(WeatherData!L107,0,WeatherData!$J$2-1))","v":""},null,0]
[null,null,{"$f":"IF(OFFSET(WeatherData!L108,0,WeatherData!$J$2-1)=\"\",\"\",OFFSET(WeatherData!L108,0,WeatherData!$J$2-1))","v":""},null,0]
[null,"-",{"$f":"IF(OFFSET(WeatherData!L109,0,WeatherData!$J$2-1)=\"\",\"\",OFFSET(WeatherData!L109,0,WeatherData!$J$2-1))","v":""},null,0]
[null,null,{"$f":"IF(OFFSET(WeatherData!L110,0,WeatherData!$J$2-1)=\"\",\"\",OFFSET(WeatherData!L110,0,WeatherData!$J$2-1))","v":""},null,0]
[null,null,{"$f":"IF(OFFSET(WeatherData!L111,0,WeatherData!$J$2-1)=\"\",\"\",OFFSET(WeatherData!L111,0,WeatherData!$J$2-1))","v":""},null,0]
[null,null,{"$f":"IF(OFFSET(WeatherData!L112,0,WeatherData!$J$2-1)=\"\",\"\",OFFSET(WeatherData!L112,0,WeatherData!$J$2-1))","v":""},null,0]
[null,null,{"$f":"IF(OFFSET(WeatherData!L113,0,WeatherData!$J$2-1)=\"\",\"\",OFFSET(WeatherData!L113,0,WeatherData!$J$2-1))","v":""},null,0]
[null,null,{"$f":"IF(OFFSET(WeatherData!L114,0,WeatherData!$J$2-1)=\"\",\"\",OFFSET(WeatherData!L114,0,WeatherData!$J$2-1))","v":""},null,0]
[null,null,{"$f":"IF(OFFSET(WeatherData!L115,0,WeatherData!$J$2-1)=\"\",\"\",OFFSET(WeatherData!L115,0,WeatherData!$J$2-1))","v":""},null,0]
[null,null,{"$f":"IF(OFFSET(WeatherData!L116,0,WeatherData!$J$2-1)=\"\",\"\",OFFSET(WeatherData!L116,0,WeatherData!$J$2-1))","v":""},null,0]
[null,null,{"$f":"IF(OFFSET(WeatherData!L117,0,WeatherData!$J$2-1)=\"\",\"\",OFFSET(WeatherData!L117,0,WeatherData!$J$2-1))","v":""},null,0]
[null,null,{"$f":"IF(OFFSET(WeatherData!L118,0,WeatherData!$J$2-1)=\"\",\"\",OFFSET(WeatherData!L118,0,WeatherData!$J$2-1))","v":""},null,0]
[null,null,{"$f":"IF(OFFSET(WeatherData!L119,0,WeatherData!$J$2-1)=\"\",\"\",OFFSET(WeatherData!L119,0,WeatherData!$J$2-1))","v":""},null,0]
[null,null,{"$f":"IF(OFFSET(WeatherData!L120,0,WeatherData!$J$2-1)=\"\",\"\",OFFSET(WeatherData!L120,0,WeatherData!$J$2-1))","v":""},null,0]
[null,null,{"$f":"IF(OFFSET(WeatherData!L121,0,WeatherData!$J$2-1)=\"\",\"\",OFFSET(WeatherData!L121,0,WeatherData!$J$2-1))","v":""},null,0]
[null,null,{"$f":"IF(OFFSET(WeatherData!L122,0,WeatherData!$J$2-1)=\"\",\"\",OFFSET(WeatherData!L122,0,WeatherData!$J$2-1))","v":""},null,0]
[null,null,{"$f":"IF(OFFSET(WeatherData!L123,0,WeatherData!$J$2-1)=\"\",\"\",OFFSET(WeatherData!L123,0,WeatherData!$J$2-1))","v":""},null,0]
[null,null,{"$f":"IF(OFFSET(WeatherData!L124,0,WeatherData!$J$2-1)=\"\",\"\",OFFSET(WeatherData!L124,0,WeatherData!$J$2-1))","v":""},null,0]
[null,null,{"$f":"IF(OFFSET(WeatherData!L125,0,WeatherData!$J$2-1)=\"\",\"\",OFFSET(WeatherData!L125,0,WeatherData!$J$2-1))","v":""},null,0]
[null,null,{"$f":"IF(OFFSET(WeatherData!L126,0,WeatherData!$J$2-1)=\"\",\"\",OFFSET(WeatherData!L126,0,WeatherData!$J$2-1))","v":""},null,0]
[null,null,{"$f":"IF(OFFSET(WeatherData!L127,0,WeatherData!$J$2-1)=\"\",\"\",OFFSET(WeatherData!L127,0,WeatherData!$J$2-1))","v":""},null,0]
[null,null,{"$f":"IF(OFFSET(WeatherData!L128,0,WeatherData!$J$2-1)=\"\",\"\",OFFSET(WeatherData!L128,0,WeatherData!$J$2-1))","v":""},null,0]
[null,null,{"$f":"IF(OFFSET(WeatherData!L129,0,WeatherData!$J$2-1)=\"\",\"\",OFFSET(WeatherData!L129,0,WeatherData!$J$2-1))","v":""},null,0]
[null,null,{"$f":"IF(OFFSET(WeatherData!L130,0,WeatherData!$J$2-1)=\"\",\"\",OFFSET(WeatherData!L130,0,WeatherData!$J$2-1))","v":""},null,0]
[null,null,{"$f":"IF(OFFSET(WeatherData!L131,0,WeatherData!$J$2-1)=\"\",\"\",OFFSET(WeatherData!L131,0,WeatherData!$J$2-1))","v":""},null,0]
[null,null,{"$f":"IF(OFFSET(WeatherData!L132,0,WeatherData!$J$2-1)=\"\",\"\",OFFSET(WeatherData!L132,0,WeatherData!$J$2-1))","v":""},null,0]
[null,null,{"$f":"IF(OFFSET(WeatherData!L133,0,WeatherData!$J$2-1)=\"\",\"\",OFFSET(WeatherData!L133,0,WeatherData!$J$2-1))","v":""},null,0]
[null,null,{"$f":"IF(OFFSET(WeatherData!L134,0,WeatherData!$J$2-1)=\"\",\"\",OFFSET(WeatherData!L134,0,WeatherData!$J$2-1))","v":""},null,0]
[null,null,{"$f":"IF(OFFSET(WeatherData!L135,0,WeatherData!$J$2-1)=\"\",\"\",OFFSET(WeatherData!L135,0,WeatherData!$J$2-1))","v":""},null,{"$f":"IF(C125<>\"\",1,0)","v":0}]
[null,null,{"$f":"IF(OFFSET(WeatherData!L136,0,WeatherData!$J$2-1)=\"\",\"\",OFFSET(WeatherData!L136,0,WeatherData!$J$2-1))","v":""},null,0]
[null,null,{"$f":"IF(OFFSET(WeatherData!L137,0,WeatherData!$J$2-1)=\"\",\"\",OFFSET(WeatherData!L137,0,WeatherData!$J$2-1))","v":""},null,0]
[null,null,{"$f":"IF(OFFSET(WeatherData!L138,0,WeatherData!$J$2-1)=\"\",\"\",OFFSET(WeatherData!L138,0,WeatherData!$J$2-1))","v":""},null,0]
[null,null,{"$f":"IF(OFFSET(WeatherData!L139,0,WeatherData!$J$2-1)=\"\",\"\",OFFSET(WeatherData!L139,0,WeatherData!$J$2-1))","v":""},null,0]
[null,null,{"$f":"IF(OFFSET(WeatherData!L140,0,WeatherData!$J$2-1)=\"\",\"\",OFFSET(WeatherData!L140,0,WeatherData!$J$2-1))","v":""},null,0]
[null,null,{"$f":"IF(OFFSET(WeatherData!L141,0,WeatherData!$J$2-1)=\"\",\"\",OFFSET(WeatherData!L141,0,WeatherData!$J$2-1))","v":""},null,0]

{"sheet":"Country Parameters","index":11,"n_rows":233,"n_cols":19,"rows_kept":233,"cut":false,"hidden":true,"merged":[]}
[null,1,2,3,4,5,6,7,8,9,10,11,12,13,null,null,14,15,16]
[null,"Country Parameters"]
[null,"Short-form name","Long-form name","US FIPS","Alpha-2","Alpha-3","Numeric Code","Latitude Average","Longitude Average","Region","\nGrid Average Utilized (Grams CO2/kWh)","Grams CO2/kWh\n(Coal/Peat)","Grams CO2/kWh\n(Oil)","Grams CO2/kWh\n(Natural Gas)","Grid Average (IEA) (Grams CO2/kWh)","CDM Avearge Combined Marginal (IGES)","Average Solar Insolation (kWh/m^2/day) and Average-Day Insolation (hr)","Average Grid Line Loss Rate (%)","Regional Emission Factor utilized"]
[null,"Afghanistan","Islamic Republic of Afghanistan","AF","AF","AFG",4,33,65,"Asia",{"$f":"IF(P4=\"N/A\",O4,P4)","v":846.53392083466008},919.05070000000001,785.51969999999994,527.41980000000001,451.13060000000002,846.53392083466008,5.3,5.7300046286854894E-2,{"$f":"IF(ISNUMBER(MATCH(B4,'Grid EFs'!$B$4:$B$157,0)),\"\",\"*\")","v":""}]
[null,"Albania","Republic of Albania","AL","AL","ALB",8,41,20,"Europe",{"$f":"IF(P5=\"N/A\",O5,P5)","v":312.0333333333333},919.05070000000001,785.51969999999994,527.41980000000001,6.9824000000000002,312.0333333333333,4.1399999999999997,0.10120170181363654,{"$f":"IF(ISNUMBER(MATCH(B5,'Grid EFs'!$B$4:$B$157,0)),\"\",\"*\")","v":""}]
[null,"Algeria","People's Democratic Republic of Algeria","AG","DZ","DZA",12,28,3,"Africa",720.02358500000003,974.53949999999998,935.38210000000004,528.50840000000005,549.20079999999996,720.02358500000003,5.61,9.4921608188063056E-2,{"$f":"IF(ISNUMBER(MATCH(B6,'Grid EFs'!$B$4:$B$157,0)),\"\",\"*\")","v":""}]
[null,"Andorra","Principality of Andorra","AN","AD","AND",20,42.5,1.6,"Europe",331.06400000000002,917.48320000000001,690.57929999999999,359.07440000000003,331.06400000000002,"N/A",3.7,5.8109323007447068E-2,{"$f":"IF(ISNUMBER(MATCH(B7,'Grid EFs'!$B$4:$B$157,0)),\"\",\"*\")","v":""}]
[null,"Angola","Republic of Angola","AO","AO","AGO",24,-12.5,18.5,"Africa",840.8,974.53949999999998,1343.4219000000001,456.774,390.84410000000003,840.8,5.58,7.4274443578152466E-2,{"$f":"IF(ISNUMBER(MATCH(B8,'Grid EFs'!$B$4:$B$157,0)),\"\",\"*\")","v":""}]
[null,"Antigua and Barbuda","Antigua and Barbuda","AC","AG","ATG",28,17.05,-61.8,"North America",472.44098150782378,1240.4880000000001,671.35590000000002,502.83659999999998,200.8047,472.44098150782378,6.16,5.7679364750868239E-2,{"$f":"IF(ISNUMBER(MATCH(B9,'Grid EFs'!$B$4:$B$157,0)),\"\",\"*\")","v":"*"}]
[null,"Argentina","Argentine Republic","AR","AR","ARG",32,-34,-64,"South America",504.72114285714298,1165.1775,731.76139999999998,476.05540000000002,397.17439999999999,504.72114285714298,4.8,8.483952739530716E-2,{"$f":"IF(ISNUMBER(MATCH(B10,'Grid EFs'!$B$4:$B$157,0)),\"\",\"*\")","v":"*"}]
[null,"Armenia","Republic of Armenia","AM","AM","ARM",51,40,45,"Asia",435.9666666666667,919.05070000000001,785.51969999999994,417.32839999999999,176.5181,435.9666666666667,3.96,8.1117836477101496E-2,{"$f":"IF(ISNUMBER(MATCH(B11,'Grid EFs'!$B$4:$B$157,0)),\"\",\"*\")","v":""}]
[null,"Australia","Commonwealth of Australia","AS","AU","AUS",36,-27,133,"Oceania",798.90189999999996,993.75379999999996,679.18949999999995,522.1739,798.90189999999996,"N/A",5.9,5.1088307102519909E-2,{"$f":"IF(ISNUMBER(MATCH(B12,'Grid EFs'!$B$4:$B$157,0)),\"\",\"*\")","v":""}]
[null,"Austria","Republic of Austria","AU","AT","AUT",40,47.333300000000001,13.333299999999999,"Europe",164.791,1057.8384000000001,578.3732,320.45830000000001,164.791,"N/A",3.25,4.4668720748035434E-2,{"$f":"IF(ISNUMBER(MATCH(B13,'Grid EFs'!$B$4:$B$157,0)),\"\",\"*\")","v":""}]
[null,"Azerbaijan","Republic of Azerbaijan","AJ","AZ","AZE",31,40.5,47.5,"Asia",589.7600000000001,919.05070000000001,627.95230000000004,533.89710000000002,493.66230000000002,589.7600000000001,3.48,9.2191028899319433E-2,{"$f":"IF(ISNUMBER(MATCH(B14,'Grid EFs'!$B$4:$B$157,0)),\"\",\"*\")","v":""}]
[null,"Bahamas, The","Commonwealth of The Bahamas","BF","BS","BHS",44,24.25,-76,"North America",723,1240.4880000000001,671.35590000000002,502.83659999999998,200.8047,723,5.74,5.7679364750868239E-2,{"$f":"IF(ISNUMBER(MATCH(B15,'Grid EFs'!$B$4:$B$157,0)),\"\",\"*\")","v":"*"}]
[null,"Bahrain","Kingdom of Bahrain","BA","BH","BHR",48,26,50.55,"Asia",679.18018867924513,1144.2709,915.41219999999998,754.71889999999996,754.71889999999996,679.18018867924513,6.01,5.6529996543816623E-2,{"$f":"IF(ISNUMBER(MATCH(B16,'Grid EFs'!$B$4:$B$157,0)),\"\",\"*\")","v":"*"}]
[null,"Bangladesh","People's Republic of Bangladesh","BG","BD","BGD",50,24,90,"Asia",640.68500000000006,1037.0159000000001,598.72649999999999,572.85310000000004,575.11630000000002,640.68500000000006,4.6500000000000004,7.5634750299117065E-2,{"$f":"IF(ISNUMBER(MATCH(B17,'Grid EFs'!$B$4:$B$157,0)),\"\",\"*\")","v":""}]
[null,"Barbados","Barbados","BB","BB","BRB",52,13.166700000000001,-59.533299999999997,"North America",472.44098150782378,1240.4880000000001,671.35590000000002,502.83659999999998,200.8047,472.44098150782378,6.1,5.7679364750868239E-2,{"$f":"IF(ISNUMBER(MATCH(B18,'Grid EFs'!$B$4:$B$157,0)),\"\",\"*\")","v":"*"}]
[null,"Belarus","Republic of Belarus","BO","BY","BLR",112,53,28,"Europe",425.11810000000003,1487.011,583.20280000000002,422.51690000000002,425.11810000000003,"N/A",2.82,7.3645600865716615E-2,{"$f":"IF(ISNUMBER(MATCH(B19,'Grid EFs'!$B$4:$B$157,0)),\"\",\"*\")","v":""}]
[null,"Belgium","Kingdom of Belgium","BE","BE","BEL",56,50.833300000000001,4,"Europe",212.018,1318.2679000000001,507.5213,313.30309999999997,212.018,"N/A",2.81,4.2668640828300589E-2,{"$f":"IF(ISNUMBER(MATCH(B20,'Grid EFs'!$B$4:$B$157,0)),\"\",\"*\")","v":""}]
[null,"Belize","Belize","BH","BZ","BLZ",84,17.25,-88.75,"North America",151.9,1240.4880000000001,671.35590000000002,502.83659999999998,200.8047,151.9,4.8499999999999996,5.7679364750868239E-2,{"$f":"IF(ISNUMBER(MATCH(B21,'Grid EFs'!$B$4:$B$157,0)),\"\",\"*\")","v":"*"}]
[null,"Benin","Republic of Benin","BN","BJ","BEN",204,9.5,2.25,"Africa",720.02358500000003,974.53949999999998,725.1481,456.774,720.69939999999997,720.02358500000003,5.59,7.571494692664206E-2,{"$f":"IF(ISNUMBER(MATCH(B22,'Grid EFs'!$B$4:$B$157,0)),\"\",\"*\")","v":""}]
[null,"Bhutan","Kingdom of Bhutan","BT","BT","BTN",64,27.5,90.5,"Asia",830.45,1144.2709,843.06479999999999,451.97480000000002,736.13379999999995,830.45,5.31,5.7300046286854894E-2,{"$f":"IF(ISNUMBER(MATCH(B23,'Grid EFs'!$B$4:$B$157,0)),\"\",\"*\")","v":""}]
[null,"Bolivia","Plurinational State of Bolivia","BL","BO","BOL",68,-17,-65,"South America",588.75,1240.4880000000001,942.25810000000001,634.07849999999996,426.27800000000002,588.75,4.6100000000000003,7.3745933119281321E-2,{"$f":"IF(ISNUMBER(MATCH(B24,'Grid EFs'!$B$4:$B$157,0)),\"\",\"*\")","v":"*"}]
[null,"Bosnia and Herzegovina","Bosnia and Herzegovina","BK","BA","BIH",70,44,18,"Europe",973.15,1395.2871,765.82140000000004,694.42309999999998,973.81259999999997,973.15,3.43,7.0304641404584214E-2,{"$f":"IF(ISNUMBER(MATCH(B25,'Grid EFs'!$B$4:$B$157,0)),\"\",\"*\")","v":""}]
[null,"Botswana","Republic of Botswana","BC","BW","BWA",72,-22,24,"Africa",720.02358500000003,1478.836,833.97270000000003,456.774,1478.836,720.02358500000003,5.87,7.571494692664206E-2,{"$f":"IF(ISNUMBER(MATCH(B26,'Grid EFs'!$B$4:$B$157,0)),\"\",\"*\")","v":""}]
[null,"Brazil","Federative Republic of Brazil","BR","BR","BRA",76,-10,-55,"South America",292.37793200000033,1409.4494,726.96900000000005,428.30650000000003,98.173900000000003,292.37793200000033,4.87,8.9500586040335006E-2,{"$f":"IF(ISNUMBER(MATCH(B27,'Grid EFs'!$B$4:$B$157,0)),\"\",\"*\")","v":"*"}]
[null,"Brunei Darussalam","Brunei Darussalam","BX","BN","BRN",96,4.5,114.66670000000001,"Asia",846.53392083466008,1144.2709,858.10810000000004,721.75040000000001,722.66690000000006,846.53392083466008,5.65,6.0705841105028524E-2,{"$f":"IF(ISNUMBER(MATCH(B28,'Grid EFs'!$B$4:$B$157,0)),\"\",\"*\")","v":""}]
[null,"Bulgaria","Republic of Bulgaria","BU","BG","BGR",100,43,25,"Europe",531.69439999999997,1042.7764,782.32849999999996,311.90859999999998,531.69439999999997,"N/A",3.78,6.7275341301240382E-2,{"$f":"IF(ISNUMBER(MATCH(B29,'Grid EFs'!$B$4:$B$157,0)),\"\",\"*\")","v":""}]
[null,"Burkina Faso","Burkina Faso","UV","BF","BFA",854,13,-2,"Africa",470.62499999999994,974.53949999999998,833.97270000000003,456.774,597.66229999999996,470.62499999999994,5.95,7.571494692664206E-2,{"$f":"IF(ISNUMBER(MATCH(B30,'Grid EFs'!$B$4:$B$157,0)),\"\",\"*\")","v":""}]
[null,"Burma","Union of Burma","BM",null,null,null,20,96,"Asia",394.8,939.99220000000003,809.33330000000001,724.95759999999996,216.20570000000001,394.8,5.14,0.10284541921067245,{"$f":"IF(ISNUMBER(MATCH(B31,'Grid EFs'!$B$4:$B$157,0)),\"\",\"*\")","v":""}]
[null,"Burundi","Republic of Burundi","BY","BI","BDI",108,-3.5,30,"Africa",720.02358500000003,974.53949999999998,833.97270000000003,456.774,597.66229999999996,720.02358500000003,5.05,7.571494692664206E-2,{"$f":"IF(ISNUMBER(MATCH(B32,'Grid EFs'!$B$4:$B$157,0)),\"\",\"*\")","v":""}]
[null,"Cambodia","Kingdom of Cambodia","CB","KH","KHM",116,13,105,"Asia",585.86,1062.6486,839.21820000000002,451.97480000000002,528.95960000000002,585.86,5.27,0.10295623418100149,{"$f":"IF(ISNUMBER(MATCH(B33,'Grid EFs'!$B$4:$B$157,0)),\"\",\"*\")","v":""}]
[null,"Cameroon","Republic of Cameroon","CM","CM","CMR",120,6,12,"Africa",390,974.53949999999998,859.74220000000003,537.85019999999997,208.59460000000001,390,5.65,6.8913922466941349E-2,{"$f":"IF(ISNUMBER(MATCH(B34,'Grid EFs'!$B$4:$B$157,0)),\"\",\"*\")","v":""}]
[null,"Canada","Canada","CA","CA","CAN",124,60,-95,"North America",150.88890000000001,900.98339999999996,882.01819999999998,475.46699999999998,150.88890000000001,"N/A",2.87,6.4650871431311707E-2,{"$f":"IF(ISNUMBER(MATCH(B35,'Grid EFs'!$B$4:$B$157,0)),\"\",\"*\")","v":""}]
[null,"Cape Verde","Republic of Cape Verde","CV","CV","CPV",132,16,-24,"Africa",654.90000000000009,974.53949999999998,833.97270000000003,456.774,597.66229999999996,654.90000000000009,5.9,7.571494692664206E-2,{"$f":"IF(ISNUMBER(MATCH(B36,'Grid EFs'!$B$4:$B$157,0)),\"\",\"*\")","v":""}]
[null,"Central African Republic","Central African Republic","CT","CF","CAF",140,7,21,"Africa",720.02358500000003,974.53949999999998,833.97270000000003,456.774,597.66229999999996,720.02358500000003,5.69,7.571494692664206E-2,{"$f":"IF(ISNUMBER(MATCH(B37,'Grid EFs'!$B$4:$B$157,0)),\"\",\"*\")","v":""}]
[null,"Chad","Republic of Chad","CD","TD","TCD",148,15,19,"Africa",720.02358500000003,974.53949999999998,833.97270000000003,456.774,597.66229999999996,720.02358500000003,6.64,7.571494692664206E-2,{"$f":"IF(ISNUMBER(MATCH(B38,'Grid EFs'!$B$4:$B$157,0)),\"\",\"*\")","v":""}]
[null,"Chile","Republic of Chile","CI","CL","CHL",152,-30,-71,"South America",598.5909591836737,868.79169999999999,984.12059999999997,438.09780000000001,482.97699999999998,598.5909591836737,5.59,6.008554031852776E-2,{"$f":"IF(ISNUMBER(MATCH(B39,'Grid EFs'!$B$4:$B$157,0)),\"\",\"*\")","v":""}]
[null,"China","People's Republic of China","CH","CN","CHN",156,35,105,"Asia",850.280479512748,948.2106,755.21159999999998,508.38440000000003,734.28530000000001,850.280479512748,4.28,5.3072478000304985E-2,{"$f":"IF(ISNUMBER(MATCH(B40,'Grid EFs'!$B$4:$B$157,0)),\"\",\"*\")","v":"*"}]
[null,"Colombia","Republic of Colombia","CO","CO","COL",170,4,-72,"South America",333.13090909090914,959.6617,921.27110000000005,451.85820000000001,122.7676,333.13090909090914,4.8600000000000003,8.2565240146690311E-2,{"$f":"IF(ISNUMBER(MATCH(B41,'Grid EFs'!$B$4:$B$157,0)),\"\",\"*\")","v":"*"}]
[null,"Comoros","Union of the Comoros","CN","KM","COM",174,-12.166700000000001,44.25,"Africa",720.02358500000003,974.53949999999998,833.97270000000003,456.774,597.66229999999996,720.02358500000003,6.22,7.571494692664206E-2,{"$f":"IF(ISNUMBER(MATCH(B42,'Grid EFs'!$B$4:$B$157,0)),\"\",\"*\")","v":""}]
[null,"Congo","Republic of the Congo","CF","CG","COG",178,-1,15,"Africa",720.02358500000003,974.53949999999998,1058.4444000000001,584.13869999999997,229.9598,720.02358500000003,4.8600000000000003,0.16409249290783473,{"$f":"IF(ISNUMBER(MATCH(B43,'Grid EFs'!$B$4:$B$157,0)),\"\",\"*\")","v":""}]
[null,"Congo, Democratic Republic","Democratic Republic of the Congo","CG","CD","COD",180,0,25,"Africa",720.02358500000003,974.53949999999998,1058.1667,573.20690000000002,2.8837999999999999,720.02358500000003,4.8,5.4988988608486125E-2,{"$f":"IF(ISNUMBER(MATCH(B44,'Grid EFs'!$B$4:$B$157,0)),\"\",\"*\")","v":""}]
[null,"Costa Rica","Republic of Costa Rica","CS","CR","CRI",188,10,-84,"North America",280.52307692307693,1240.4880000000001,666.34820000000002,502.83659999999998,54.355699999999999,280.52307692307693,4.1500000000000004,7.2176076836942007E-2,{"$f":"IF(ISNUMBER(MATCH(B45,'Grid EFs'!$B$4:$B$157,0)),\"\",\"*\")","v":"*"}]
[null,"Côte d'Ivoire","Republic of Côte d'Ivoire","IV","CI","CIV",384,8,-5,"Africa",634.44999999999993,974.53949999999998,928.70090000000005,642.93790000000001,490.38060000000002,634.44999999999993,5.0999999999999996,9.7900354249586069E-2,{"$f":"IF(ISNUMBER(MATCH(B46,'Grid EFs'!$B$4:$B$157,0)),\"\",\"*\")","v":""}]
[null,"Croatia","Republic of Croatia","HR","HR","HRV",191,45.166699999999999,15.5,"Europe",311.06299999999999,868.73990000000003,638.58630000000005,365.64839999999998,311.06299999999999,"N/A",3.54,8.7756785661199613E-2,{"$f":"IF(ISNUMBER(MATCH(B47,'Grid EFs'!$B$4:$B$157,0)),\"\",\"*\")","v":""}]
[null,"Cuba","Republic of Cuba","CU","CU","CUB",192,21.5,-80,"North America",873.5,1240.4880000000001,989.4932,502.23230000000001,897.25570000000005,873.5,5.05,8.7291441760489002E-2,{"$f":"IF(ISNUMBER(MATCH(B48,'Grid EFs'!$B$4:$B$157,0)),\"\",\"*\")","v":"*"}]
[null,"Cyprus","Republic of Cyprus","CY","CY","CYP",196,35,33,"Europe",798.22,919.05070000000001,768.14729999999997,527.41980000000001,726.29570000000001,798.22,5.19,3.4014957464301235E-2,{"$f":"IF(ISNUMBER(MATCH(B49,'Grid EFs'!$B$4:$B$157,0)),\"\",\"*\")","v":""}]
[null,"Czech Republic","Czech Republic","EZ","CZ","CZE",203,49.75,15.5,"Europe",551.84950000000003,1008.5516,925.98440000000005,419.25749999999999,551.84950000000003,"N/A",2.84,4.5793323849111701E-2,{"$f":"IF(ISNUMBER(MATCH(B50,'Grid EFs'!$B$4:$B$157,0)),\"\",\"*\")","v":""}]
[null,"Denmark","Kingdom of Denmark","DA","DK","DNK",208,56,10,"Europe",257.26420000000002,579.9076,602.43290000000002,270.12759999999997,257.26420000000002,"N/A",2.91,5.5707210593762352E-2,{"$f":"IF(ISNUMBER(MATCH(B51,'Grid EFs'!$B$4:$B$157,0)),\"\",\"*\")","v":""}]
[null,"Djibouti","Republic of Djibouti","DJ","DJ","DJI",262,11.5,43,"Africa",720.02358500000003,974.53949999999998,833.97270000000003,456.774,597.66229999999996,720.02358500000003,6.05,7.571494692664206E-2,{"$f":"IF(ISNUMBER(MATCH(B52,'Grid EFs'!$B$4:$B$157,0)),\"\",\"*\")","v":""}]
[null,"Dominica","Commonwealth of Dominica","DO","DM","DMA",212,15.416700000000001,-61.333300000000001,"North America",472.44098150782378,1240.4880000000001,671.35590000000002,502.83659999999998,200.8047,472.44098150782378,5.97,5.7679364750868239E-2,{"$f":"IF(ISNUMBER(MATCH(B53,'Grid EFs'!$B$4:$B$157,0)),\"\",\"*\")","v":"*"}]
[null,"Dominican Republic","Dominican Republic","DR","DO","DOM",214,19,-70.666700000000006,"North America",637.8599999999999,953.69870000000003,616.92409999999995,458.23329999999999,555.25109999999995,637.8599999999999,5.0999999999999996,7.7815670694859229E-2,{"$f":"IF(ISNUMBER(MATCH(B54,'Grid EFs'!$B$4:$B$157,0)),\"\",\"*\")","v":"*"}]
[null,"Ecuador","Republic of Ecuador","EC","EC","ECU",218,-2,-77.5,"South America",566.77962962962954,1240.4880000000001,752.96360000000004,490.99270000000001,313.02069999999998,566.77962962962954,3.75,8.7447715846942081E-2,{"$f":"IF(ISNUMBER(MATCH(B55,'Grid EFs'!$B$4:$B$157,0)),\"\",\"*\")","v":"*"}]
[null,"Egypt","Arab Republic of Egypt","EG","EG","EGY",818,27,30,"Africa",532.76666666666677,974.53949999999998,834.98019999999997,418.28910000000002,443.76,532.76666666666677,6.05,7.0400638981562028E-2,{"$f":"IF(ISNUMBER(MATCH(B56,'Grid EFs'!$B$4:$B$157,0)),\"\",\"*\")","v":""}]
[null,"El Salvador","Republic of El Salvador","ES","SV","SLV",222,13.833299999999999,-88.916700000000006,"North America",678.41428571428571,1240.4880000000001,662.95349999999996,502.83659999999998,238.35130000000001,678.41428571428571,5.28,7.4692994471491109E-2,{"$f":"IF(ISNUMBER(MATCH(B57,'Grid EFs'!$B$4:$B$157,0)),\"\",\"*\")","v":"*"}]
[null,"Equatorial Guinea","Republic of Equatorial Guinea","EK","GQ","GNQ",226,2,10,"Africa",720.02358500000003,974.53949999999998,833.97270000000003,456.774,597.66229999999996,720.02358500000003,4.3499999999999996,7.571494692664206E-2,{"$f":"IF(ISNUMBER(MATCH(B58,'Grid EFs'!$B$4:$B$157,0)),\"\",\"*\")","v":""}]
[null,"Eritrea","State of Eritrea","ER","ER","ERI",232,15,39,"Africa",720.02358500000003,974.53949999999998,854.09799999999996,456.774,849.33979999999997,720.02358500000003,5.48,8.320590989926839E-2,{"$f":"IF(ISNUMBER(MATCH(B59,'Grid EFs'!$B$4:$B$157,0)),\"\",\"*\")","v":""}]
[null,"Estonia","Republic of Estonia","EN","EE","EST",233,59,26,"Europe",911.99310000000003,1050.2034000000001,840.80529999999999,240.0607,911.99310000000003,"N/A",2.82,6.1741215301746567E-2,{"$f":"IF(ISNUMBER(MATCH(B60,'Grid EFs'!$B$4:$B$157,0)),\"\",\"*\")","v":""}]
[null,"Ethiopia","Federal Democratic Republic of Ethiopia","ET","ET","ETH",231,8,38,"Africa",3.4615E-2,974.53949999999998,1111.2750000000001,456.774,6.6345000000000001,3.4615E-2,5.81,9.0737612181809923E-2,{"$f":"IF(ISNUMBER(MATCH(B61,'Grid EFs'!$B$4:$B$157,0)),\"\",\"*\")","v":""}]
[null,"Fiji","Republic of Fiji","FJ","FJ","FJI",242,-18,175,"Oceania",596.49999999999989,1144.2709,843.06479999999999,451.97480000000002,736.13379999999995,596.49999999999989,5.47,5.2001785658027835E-2,{"$f":"IF(ISNUMBER(MATCH(B62,'Grid EFs'!$B$4:$B$157,0)),\"\",\"*\")","v":""}]
[null,"Finland","Republic of Finland","FI","FI","FIN",246,64,26,"Europe",134.1499,661.47760000000005,570.2242,241.48099999999999,134.1499,"N/A",2.48,3.487435012324297E-2,{"$f":"IF(ISNUMBER(MATCH(B63,'Grid EFs'!$B$4:$B$157,0)),\"\",\"*\")","v":""}]
[null,"France","French Republic","FR","FR","FRA",250,46,2,"Europe",69.254199999999997,1046.1799000000001,623.31330000000003,457.6925,69.254199999999997,"N/A",3.34,5.5384649184760749E-2,{"$f":"IF(ISNUMBER(MATCH(B64,'Grid EFs'!$B$4:$B$157,0)),\"\",\"*\")","v":""}]
[null,"Gabon","Gabonese Republic","GB","GA","GAB",266,-1,11.75,"Africa",360.3,974.53949999999998,714.58309999999994,763.5163,436.12560000000002,360.3,4.55,9.526458561652712E-2,{"$f":"IF(ISNUMBER(MATCH(B65,'Grid EFs'!$B$4:$B$157,0)),\"\",\"*\")","v":""}]
[null,"Gambia, The","Republic of The Gambia","GA","GM","GMB",270,13.466699999999999,-16.566700000000001,"Africa",720.02358500000003,974.53949999999998,833.97270000000003,456.774,597.66229999999996,720.02358500000003,5.75,7.571494692664206E-2,{"$f":"IF(ISNUMBER(MATCH(B66,'Grid EFs'!$B$4:$B$157,0)),\"\",\"*\")","v":""}]
[null,"Georgia","Georgia","GG","GE","GEO",268,42,43.5,"Asia",402.46600000000001,919.05070000000001,785.51969999999994,458.91669999999999,117.01309999999999,402.46600000000001,3.77,7.321278244601806E-2,{"$f":"IF(ISNUMBER(MATCH(B67,'Grid EFs'!$B$4:$B$157,0)),\"\",\"*\")","v":""}]
[null,"Germany","Federal Republic of Germany","GM","DE","DEU",276,51,9,"Europe",475.40809999999999,894.91300000000001,606.77779999999996,331.24009999999998,475.40809999999999,"N/A",2.7,3.6652588492908249E-2,{"$f":"IF(ISNUMBER(MATCH(B68,'Grid EFs'!$B$4:$B$157,0)),\"\",\"*\")","v":""}]
[null,"Ghana","Republic of Ghana","GH","GH","GHA",288,8,-2,"Africa",{"$f":"IF(P69=\"N/A\",O69,P69)","v":478.51500000000004},974.53949999999998,869.63149999999996,566.91849999999999,249.44489999999999,478.51500000000004,5.28,0.10121890471249963,{"$f":"IF(ISNUMBER(MATCH(B69,'Grid EFs'!$B$4:$B$157,0)),\"\",\"*\")","v":""}]
[null,"Greece","Hellenic Republic","GR","GR","GRC",300,39,22,"Europe",684.61030000000005,1024.2320999999999,737.72590000000002,387.5806,684.61030000000005,"N/A",4.16,4.727855578999432E-2,{"$f":"IF(ISNUMBER(MATCH(B70,'Grid EFs'!$B$4:$B$157,0)),\"\",\"*\")","v":""}]
[null,"Grenada","Grenada","GJ","GD","GRD",308,12.1167,-61.666699999999999,"North America",472.44098150782378,1240.4880000000001,671.35590000000002,502.83659999999998,200.8047,472.44098150782378,6.21,5.7679364750868239E-2,{"$f":"IF(ISNUMBER(MATCH(B71,'Grid EFs'!$B$4:$B$157,0)),\"\",\"*\")","v":"*"}]
[null,"Guatemala","Republic of Guatemala","GT","GT","GTM",320,15.5,-90.25,"North America",589.38666666666666,960.22540000000004,640.81590000000006,502.83659999999998,254.23429999999999,589.38666666666666,4.87,8.2606532693671908E-2,{"$f":"IF(ISNUMBER(MATCH(B72,'Grid EFs'!$B$4:$B$157,0)),\"\",\"*\")","v":"*"}]
[null,"Guinea","Republic of Guinea","GV","GN","GIN",324,11,-10,"Africa",720.02358500000003,974.53949999999998,833.97270000000003,456.774,597.66229999999996,720.02358500000003,5.67,7.571494692664206E-2,{"$f":"IF(ISNUMBER(MATCH(B73,'Grid EFs'!$B$4:$B$157,0)),\"\",\"*\")","v":""}]
[null,"Guinea-Bissau","Republic of Guinea-Bissau","PU","GW","GNB",624,12,-15,"Africa",720.02358500000003,974.53949999999998,833.97270000000003,456.774,597.66229999999996,720.02358500000003,5.66,7.571494692664206E-2,{"$f":"IF(ISNUMBER(MATCH(B74,'Grid EFs'!$B$4:$B$157,0)),\"\",\"*\")","v":""}]
[null,"Guyana","Co-operative Republic of Guyana","GY","GY","GUY",328,5,-59,"South America",948.30000000000007,1240.4880000000001,671.35590000000002,502.83659999999998,200.8047,948.30000000000007,4.8899999999999997,8.3808354719636283E-2,{"$f":"IF(ISNUMBER(MATCH(B75,'Grid EFs'!$B$4:$B$157,0)),\"\",\"*\")","v":"*"}]
[null,"Haiti","Republic of Haiti","HA","HT","HTI",332,19,-72.416700000000006,"North America",472.44098150782378,1240.4880000000001,687.30100000000004,502.83659999999998,591.67650000000003,472.44098150782378,5.47,0.16997056886453349,{"$f":"IF(ISNUMBER(MATCH(B76,'Grid EFs'!$B$4:$B$157,0)),\"\",\"*\")","v":"*"}]
[null,"Holy See","Holy See","VT","VA","VAT",336,41.9,12.45,"Europe",331.06400000000002,917.48320000000001,690.57929999999999,359.07440000000003,331.06400000000002,"N/A",4.08,5.8109323007447068E-2,{"$f":"IF(ISNUMBER(MATCH(B77,'Grid EFs'!$B$4:$B$157,0)),\"\",\"*\")","v":""}]
[null,"Honduras","Republic of Honduras","HO","HN","HND",340,15,-86.5,"North America",659.2249999999998,927.07749999999999,637.28480000000002,502.83659999999998,363.47480000000002,659.2249999999998,5.05,0.10999961316374203,{"$f":"IF(ISNUMBER(MATCH(B78,'Grid EFs'!$B$4:$B$157,0)),\"\",\"*\")","v":"*"}]
[null,"Hungary","Hungary","HU","HU","HUN",348,47,20,"Europe",314.01240000000001,1085.4237000000001,851.28489999999999,370.63900000000001,314.01240000000001,"N/A",3.42,7.2762088179621043E-2,{"$f":"IF(ISNUMBER(MATCH(B79,'Grid EFs'!$B$4:$B$157,0)),\"\",\"*\")","v":""}]
[null,"Iceland","Republic of Iceland","IC","IS","ISL",352,65,-18,"Europe",0.1779,917.48320000000001,1040.6667,359.07440000000003,0.1779,"N/A",2,2.8281817890827204E-2,{"$f":"IF(ISNUMBER(MATCH(B80,'Grid EFs'!$B$4:$B$157,0)),\"\",\"*\")","v":""}]
[null,"India","Republic of India","IN","IN","IND",356,20,77,"Asia",905.00592497628338,1218.9636,1098.298,440.04199999999997,926.09799999999996,905.00592497628338,5.23,9.4936484643830046E-2,{"$f":"IF(ISNUMBER(MATCH(B81,'Grid EFs'!$B$4:$B$157,0)),\"\",\"*\")","v":""}]
[null,"Indonesia","Republic of Indonesia","ID","ID","IDN",360,-5,120,"Asia",777.71475409836069,1111.7001,869.32550000000003,529.69830000000002,809.18769999999995,777.71475409836069,5.05,6.7548430769630338E-2,{"$f":"IF(ISNUMBER(MATCH(B82,'Grid EFs'!$B$4:$B$157,0)),\"\",\"*\")","v":""}]
[null,"Iran","Islamic Republic of Iran","IR","IR","IRN",364,32,53,"Asia",672.77,1144.2709,905.75850000000003,473.08449999999999,568.67899999999997,672.77,5.34,8.531177294768473E-2,{"$f":"IF(ISNUMBER(MATCH(B83,'Grid EFs'!$B$4:$B$157,0)),\"\",\"*\")","v":"*"}]
[null,"Iraq","Republic of Iraq","IZ","IQ","IRQ",368,33,44,"Asia",679.18018867924513,1144.2709,1945.5879,330.7998,907.31920000000002,679.18018867924513,5.0199999999999996,0.12766128361792253,{"$f":"IF(ISNUMBER(MATCH(B84,'Grid EFs'!$B$4:$B$157,0)),\"\",\"*\")","v":"*"}]
[null,"Ireland","Ireland","EI","IE","IRL",372,53,-8,"Europe",456.58359999999999,857.84320000000002,710.49,385.3494,456.58359999999999,"N/A",2.42,5.9890561655961128E-2,{"$f":"IF(ISNUMBER(MATCH(B85,'Grid EFs'!$B$4:$B$157,0)),\"\",\"*\")","v":""}]
[null,"Israel","State of Israel","IS","IL","ISR",376,31.5,34.75,"Asia",700.81263157894739,851.55619999999999,869.50779999999997,364.53910000000002,766.67169999999999,700.81263157894739,5.19,2.9304993199727951E-2,{"$f":"IF(ISNUMBER(MATCH(B86,'Grid EFs'!$B$4:$B$157,0)),\"\",\"*\")","v":""}]
[null,"Italy","Italian Republic","IT","IT","ITA",380,42.833300000000001,12.833299999999999,"Europe",385.04079999999999,900.39570000000003,757.4991,370.93520000000001,385.04079999999999,"N/A",3.75,5.7985703238292274E-2,{"$f":"IF(ISNUMBER(MATCH(B87,'Grid EFs'!$B$4:$B$157,0)),\"\",\"*\")","v":""}]
[null,"Jamaica","Jamaica","JM","JM","JAM",388,18.25,-77.5,"North America",783.2,1240.4880000000001,704.72829999999999,502.83659999999998,642.77409999999998,783.2,5.6,0.10257433755508308,{"$f":"IF(ISNUMBER(MATCH(B88,'Grid EFs'!$B$4:$B$157,0)),\"\",\"*\")","v":"*"}]
[null,"Japan","Japan","JA","JP","JPN",392,36,138,"Asia",846.53392083466008,908.60310000000004,613.74609999999996,437.642,550.88379999999995,846.53392083466008,3.63,4.1804802630211163E-2,{"$f":"IF(ISNUMBER(MATCH(B89,'Grid EFs'!$B$4:$B$157,0)),\"\",\"*\")","v":""}]
[null,"Jordan","Hashemite Kingdom of Jordan","JO","JO","JOR",400,31,36,"Asia",575.23333333333335,1144.2709,670.17309999999998,499.36489999999998,635.61580000000004,575.23333333333335,5.34,8.4241217866165952E-2,{"$f":"IF(ISNUMBER(MATCH(B90,'Grid EFs'!$B$4:$B$157,0)),\"\",\"*\")","v":"*"}]
[null,"Kazakhstan","Republic of Kazakhstan","KZ","KZ","KAZ",398,48,68,"Asia",846.53392083466008,491.55970000000002,301.59410000000003,573.98879999999997,460.87490000000003,846.53392083466008,3.83,6.441055862536349E-2,{"$f":"IF(ISNUMBER(MATCH(B91,'Grid EFs'!$B$4:$B$157,0)),\"\",\"*\")","v":""}]
[null,"Kenya","Republic of Kenya","KE","KE","KEN",404,1,38,"Africa",582.54153846153838,974.53949999999998,898.12819999999999,456.774,223.17779999999999,582.54153846153838,6.08,9.0117373839958784E-2,{"$f":"IF(ISNUMBER(MATCH(B92,'Grid EFs'!$B$4:$B$157,0)),\"\",\"*\")","v":""}]
[null,"Kiribati","Republic of Kiribati","KR","KI","KIR",296,1.4167000000000001,173,"Oceania",736.13379999999995,1144.2709,843.06479999999999,451.97480000000002,736.13379999999995,"N/A",5.96,5.2001785658027835E-2,{"$f":"IF(ISNUMBER(MATCH(B93,'Grid EFs'!$B$4:$B$157,0)),\"\",\"*\")","v":""}]
[null,"Korea, North","Democratic People's Republic of Korea","KN","KP","PRK",408,40,127,"Asia",911.65,1255.8557000000001,1380.2612999999999,451.97480000000002,378.04820000000001,911.65,4.03,8.7624497301248452E-2,{"$f":"IF(ISNUMBER(MATCH(B94,'Grid EFs'!$B$4:$B$157,0)),\"\",\"*\")","v":""}]
[null,"Korea, South","Republic of Korea","KS","KR","KOR",410,37,127.5,"Asia",625.37875000000008,924.70600000000002,649.11210000000005,419.58620000000002,540.3365,625.37875000000008,3.88,3.2314563389374634E-2,{"$f":"IF(ISNUMBER(MATCH(B95,'Grid EFs'!$B$4:$B$157,0)),\"\",\"*\")","v":""}]
[null,"Kosovo","Republic of Kosovo","KV","RS","XKX",null,42,21,"Europe",1026.3259,1040.9362000000001,1110.4793999999999,527.41980000000001,1026.3259,"N/A",3.74,8.9069375133888309E-2,{"$f":"IF(ISNUMBER(MATCH(B96,'Grid EFs'!$B$4:$B$157,0)),\"\",\"*\")","v":""}]
[null,"Kuwait","State of Kuwait","KU","KW","KWT",414,29.337499999999999,47.658099999999997,"Asia",780,1144.2709,842.09519999999998,573.92409999999995,744.97059999999999,780,5.57,8.1267237119299576E-2,{"$f":"IF(ISNUMBER(MATCH(B97,'Grid EFs'!$B$4:$B$157,0)),\"\",\"*\")","v":"*"}]
[null,"Kyrgyzstan","Kyrgyz Republic","KG","KG","KGZ",417,41,75,"Asia",846.53392083466008,443.45170000000002,936.13329999999996,448.21289999999999,34.786499999999997,846.53392083466008,4.4000000000000004,0.10150764628784838,{"$f":"IF(ISNUMBER(MATCH(B98,'Grid EFs'!$B$4:$B$157,0)),\"\",\"*\")","v":""}]
[null,"Laos","Lao People's Democratic Republic","LA","LA","LAO",418,18,105,"Asia",573.90190476190469,1144.2709,843.06479999999999,451.97480000000002,736.13379999999995,573.90190476190469,4.01,5.7300046286854894E-2,{"$f":"IF(ISNUMBER(MATCH(B99,'Grid EFs'!$B$4:$B$157,0)),\"\",\"*\")","v":""}]
[null,"Latvia","Republic of Latvia","LG","LV","LVA",428,57,25,"Europe",91.083699999999993,919.05070000000001,702.46960000000001,256.64830000000001,91.083699999999993,"N/A",2.91,7.2143457753547496E-2,{"$f":"IF(ISNUMBER(MATCH(B100,'Grid EFs'!$B$4:$B$157,0)),\"\",\"*\")","v":""}]
[null,"Lebanon","Lebanese Republic","LE","LB","LBN",422,33.833300000000001,35.833300000000001,"Asia",650,1144.2709,864.34829999999999,547.42639999999994,805.64070000000004,650,4.93,7.4354580078326668E-2,{"$f":"IF(ISNUMBER(MATCH(B101,'Grid EFs'!$B$4:$B$157,0)),\"\",\"*\")","v":"*"}]
[null,"Lesotho","Kingdom of Lesotho","LT","LS","LSO",426,-29.5,28.5,"Africa",720.02358500000003,974.53949999999998,833.97270000000003,456.774,597.66229999999996,720.02358500000003,5.13,7.571494692664206E-2,{"$f":"IF(ISNUMBER(MATCH(B102,'Grid EFs'!$B$4:$B$157,0)),\"\",\"*\")","v":""}]
[null,"Liberia","Republic of Liberia","LI","LR","LBR",430,6.5,-9.5,"Africa",720.02358500000003,974.53949999999998,833.97270000000003,456.774,597.66229999999996,720.02358500000003,4.99,7.571494692664206E-2,{"$f":"IF(ISNUMBER(MATCH(B103,'Grid EFs'!$B$4:$B$157,0)),\"\",\"*\")","v":""}]
[null,"Libya","Libya","LY","LY","LBY",434,25,17,"Africa",793.7,974.53949999999998,858.23180000000002,383.43419999999998,568.60249999999996,793.7,5.89,9.4501315786315487E-2,{"$f":"IF(ISNUMBER(MATCH(B104,'Grid EFs'!$B$4:$B$157,0)),\"\",\"*\")","v":""}]
[null,"Liechtenstein","Principality of Liechtenstein","LS","LI","LIE",438,47.166699999999999,9.5333000000000006,"Europe",331.06400000000002,917.48320000000001,690.57929999999999,359.07440000000003,331.06400000000002,"N/A",3.34,5.8109323007447068E-2,{"$f":"IF(ISNUMBER(MATCH(B105,'Grid EFs'!$B$4:$B$157,0)),\"\",\"*\")","v":""}]
[null,"Lithuania","Republic of Lithuania","LH","LT","LTU",440,56,24,"Europe",271.19240000000002,919.05070000000001,916.47770000000003,350.495,271.19240000000002,"N/A",2.87,8.6966897015945344E-2,{"$f":"IF(ISNUMBER(MATCH(B106,'Grid EFs'!$B$4:$B$157,0)),\"\",\"*\")","v":""}]
[null,"Luxembourg","Grand Duchy of Luxembourg","LU","LU","LUX",442,49.75,6.1666999999999996,"Europe",340.3408,917.48320000000001,690.57929999999999,357.65460000000002,340.3408,"N/A",2.81,3.0645061061586217E-2,{"$f":"IF(ISNUMBER(MATCH(B107,'Grid EFs'!$B$4:$B$157,0)),\"\",\"*\")","v":""}]
[null,"Macedonia, FYR","Former Yugoslav Republic of Macedonia","MK","MK","MKD",807,41.833300000000001,22,"Europe",861.23333333333335,1069.4612,800.75,351.517,853.21860000000004,861.23333333333335,3.79,9.4054826014044579E-2,{"$f":"IF(ISNUMBER(MATCH(B108,'Grid EFs'!$B$4:$B$157,0)),\"\",\"*\")","v":""}]
[null,"Madagascar","Republic of Madagascar","MA","MG","MDG",450,-20,47,"Africa",600.9,974.53949999999998,833.97270000000003,456.774,597.66229999999996,600.9,5.49,7.571494692664206E-2,{"$f":"IF(ISNUMBER(MATCH(B109,'Grid EFs'!$B$4:$B$157,0)),\"\",\"*\")","v":""}]
[null,"Malawi","Republic of Malawi","MI","MW","MWI",454,-13.5,34,"Africa",720.02358500000003,974.53949999999998,833.97270000000003,456.774,597.66229999999996,720.02358500000003,5.22,7.571494692664206E-2,{"$f":"IF(ISNUMBER(MATCH(B110,'Grid EFs'!$B$4:$B$157,0)),\"\",\"*\")","v":""}]
[null,"Malaysia","Malaysia","MY","MY","MYS",458,2.5,112.5,"Asia",670.33902439024416,983.67769999999996,720.28020000000004,494.76960000000003,671.36329999999998,670.33902439024416,5.05,5.5166139611296301E-2,{"$f":"IF(ISNUMBER(MATCH(B111,'Grid EFs'!$B$4:$B$157,0)),\"\",\"*\")","v":""}]
[null,"Maldives","Republic of Maldives","MV","MV","MDV",462,3.25,73,"Asia",846.53392083466008,1144.2709,843.06479999999999,451.97480000000002,736.13379999999995,846.53392083466008,5.84,5.7300046286854894E-2,{"$f":"IF(ISNUMBER(MATCH(B112,'Grid EFs'!$B$4:$B$157,0)),\"\",\"*\")","v":""}]
[null,"Mali","Republic of Mali","ML","ML","MLI",466,17,-4,"Africa",613.6,974.53949999999998,833.97270000000003,456.774,597.66229999999996,613.6,6.18,7.571494692664206E-2,{"$f":"IF(ISNUMBER(MATCH(B113,'Grid EFs'!$B$4:$B$157,0)),\"\",\"*\")","v":""}]
[null,"Malta","Republic of Malta","MT","MT","MLT",470,35.833300000000001,14.583299999999999,"Europe",871.5258,919.05070000000001,881.14530000000002,527.41980000000001,871.5258,"N/A",4.9800000000000004,7.5127864818267928E-2,{"$f":"IF(ISNUMBER(MATCH(B114,'Grid EFs'!$B$4:$B$157,0)),\"\",\"*\")","v":""}]
[null,"Marshall Islands","Republic of the Marshall Islands","RM","MH","MHL",584,9,168,"Oceania",736.13379999999995,1144.2709,843.06479999999999,451.97480000000002,736.13379999999995,"N/A",5.83,5.2001785658027835E-2,{"$f":"IF(ISNUMBER(MATCH(B115,'Grid EFs'!$B$4:$B$157,0)),\"\",\"*\")","v":""}]
[null,"Mauritania","Islamic Republic of Mauritania","MR","MR","MRT",478,20,-12,"Africa",720.02358500000003,974.53949999999998,833.97270000000003,456.774,597.66229999999996,720.02358500000003,5.81,7.571494692664206E-2,{"$f":"IF(ISNUMBER(MATCH(B116,'Grid EFs'!$B$4:$B$157,0)),\"\",\"*\")","v":""}]
[null,"Mauritius","Republic of Mauritius","MP","MU","MUS",480,-20.283300000000001,57.55,"Africa",968.50000000000023,974.53949999999998,833.97270000000003,456.774,597.66229999999996,968.50000000000023,5.92,7.571494692664206E-2,{"$f":"IF(ISNUMBER(MATCH(B117,'Grid EFs'!$B$4:$B$157,0)),\"\",\"*\")","v":""}]
[null,"Mexico","United Mexican States","MX","MX","MEX",484,23,-102,"North America",529.13947368421032,963.50099999999998,696.73030000000006,406.79509999999999,453.44450000000001,529.13947368421032,5.79,8.6922303767348635E-2,{"$f":"IF(ISNUMBER(MATCH(B118,'Grid EFs'!$B$4:$B$157,0)),\"\",\"*\")","v":""}]
[null,"Micronesia, Federated States of","Federated States of Micronesia","FM","FM","FSM",583,6.9166999999999996,158.25,"Oceania",736.13379999999995,1144.2709,843.06479999999999,451.97480000000002,736.13379999999995,"N/A",5.55,5.2001785658027835E-2,{"$f":"IF(ISNUMBER(MATCH(B119,'Grid EFs'!$B$4:$B$157,0)),\"\",\"*\")","v":""}]
[null,"Moldova","Republic of Moldova","MD","MD","MDA",498,47,29,"Europe",497.12479999999999,919.05070000000001,785.51969999999994,521.75530000000003,497.12479999999999,"N/A",3.37,0.10199026384034973,{"$f":"IF(ISNUMBER(MATCH(B120,'Grid EFs'!$B$4:$B$157,0)),\"\",\"*\")","v":""}]
[null,"Monaco","Principality of Monaco","MN","MC","MCO",492,43.7333,7.4,"Europe",331.06400000000002,917.48320000000001,690.57929999999999,359.07440000000003,331.06400000000002,"N/A",3.67,5.8109323007447068E-2,{"$f":"IF(ISNUMBER(MATCH(B121,'Grid EFs'!$B$4:$B$157,0)),\"\",\"*\")","v":""}]
[null,"Mongolia","Mongolia","MG","MN","MNG",496,46,105,"Asia",1130,875.55420000000004,1038.2815000000001,451.97480000000002,884.1028,1130,4.2,8.2757554009730963E-2,{"$f":"IF(ISNUMBER(MATCH(B122,'Grid EFs'!$B$4:$B$157,0)),\"\",\"*\")","v":""}]
[null,"Montenegro","Montenegro","MJ","ME","MNE",499,42,19,"Europe",983.6,1132.5757000000001,785.51969999999994,527.41980000000001,545.46169999999995,983.6,3.88,9.8910719081152371E-2,{"$f":"IF(ISNUMBER(MATCH(B123,'Grid EFs'!$B$4:$B$157,0)),\"\",\"*\")","v":""}]
[null,"Morocco","Kingdom of Morocco","MO","MA","MAR",504,32,-5,"Africa",647.20000000000016,986.82029999999997,723.58849999999995,376.73469999999998,696.63,647.20000000000016,5.18,8.1508808637105731E-2,{"$f":"IF(ISNUMBER(MATCH(B124,'Grid EFs'!$B$4:$B$157,0)),\"\",\"*\")","v":""}]
[null,"Mozambique","Republic of Mozambique","MZ","MZ","MOZ",508,-18.25,35,"Africa",964.40000000000009,974.53949999999998,833.97270000000003,853.80949999999996,1.1821999999999999,964.40000000000009,5.41,8.6519294893573948E-2,{"$f":"IF(ISNUMBER(MATCH(B125,'Grid EFs'!$B$4:$B$157,0)),\"\",\"*\")","v":""}]
[null,"Namibia","Republic of Namibia","WA","NA","NAM",516,-22,17,"Africa",920,1402.5333000000001,1110.3333,456.774,26.995699999999999,920,6.2,0.10446053736616828,{"$f":"IF(ISNUMBER(MATCH(B126,'Grid EFs'!$B$4:$B$157,0)),\"\",\"*\")","v":""}]
[null,"Nauru","Republic of Nauru","NR","NR","NRU",520,-0.5333,166.91669999999999,"Oceania",736.13379999999995,1144.2709,843.06479999999999,451.97480000000002,736.13379999999995,"N/A",6.11,5.2001785658027835E-2,{"$f":"IF(ISNUMBER(MATCH(B127,'Grid EFs'!$B$4:$B$157,0)),\"\",\"*\")","v":""}]
[null,"Nepal","Federal Democratic Republic of Nepal","NP","NP","NPL",524,28,84,"Asia",846.53392083466008,1144.2709,712.94740000000002,451.97480000000002,3.8136000000000001,846.53392083466008,5.0599999999999996,0.12083028942699647,{"$f":"IF(ISNUMBER(MATCH(B128,'Grid EFs'!$B$4:$B$157,0)),\"\",\"*\")","v":""}]
[null,"Netherlands","Kingdom of the Netherlands","NL","NL","NLD",528,52.5,5.75,"Europe",440.69659999999999,912.89919999999995,703.0788,300.13510000000002,440.69659999999999,"N/A",2.87,3.7946664409079553E-2,{"$f":"IF(ISNUMBER(MATCH(B129,'Grid EFs'!$B$4:$B$157,0)),\"\",\"*\")","v":""}]
[null,"New Zealand","New Zealand","NZ","NZ","NZL",554,-41,174,"Oceania",173.28200000000001,1127.9532999999999,1040.6667,411.54259999999999,173.28200000000001,"N/A",4.46,5.7198995787467392E-2,{"$f":"IF(ISNUMBER(MATCH(B130,'Grid EFs'!$B$4:$B$157,0)),\"\",\"*\")","v":""}]
[null,"Nicaragua","Republic of Nicaragua","NU","NI","NIC",558,13,-85,"North America",631.24,1240.4880000000001,711.10929999999996,502.83659999999998,406.62540000000001,631.24,4.5599999999999996,9.1213803073282473E-2,{"$f":"IF(ISNUMBER(MATCH(B131,'Grid EFs'!$B$4:$B$157,0)),\"\",\"*\")","v":"*"}]
[null,"Niger","Republic of Niger","NG","NE","NER",562,16,8,"Africa",720.02358500000003,974.53949999999998,833.97270000000003,456.774,597.66229999999996,720.02358500000003,6.67,7.571494692664206E-2,{"$f":"IF(ISNUMBER(MATCH(B132,'Grid EFs'!$B$4:$B$157,0)),\"\",\"*\")","v":""}]
[null,"Nigeria","Federal Republic of Nigeria","NI","NG","NGA",566,10,8,"Africa",{"$f":"IF(P133=\"N/A\",O133,P133)","v":573.28},974.53949999999998,833.97270000000003,502.23219999999998,403.22390000000001,573.28,5.69,7.5301373595601281E-2,{"$f":"IF(ISNUMBER(MATCH(B133,'Grid EFs'!$B$4:$B$157,0)),\"\",\"*\")","v":""}]
[null,"Norway","Kingdom of Norway","NO","NO","NOR",578,62,10,"Europe",8.0572999999999997,1191.7299,304.37299999999999,338.78710000000001,8.0572999999999997,"N/A",2.4300000000000002,5.714087819177658E-2,{"$f":"IF(ISNUMBER(MATCH(B134,'Grid EFs'!$B$4:$B$157,0)),\"\",\"*\")","v":""}]
[null,"Oman","Sultanate of Oman","MU","OM","OMN",512,21,57,"Asia",679.18018867924513,1144.2709,766.20500000000004,598.00850000000003,602.0761,679.18018867924513,5.77,8.4378298802939206E-2,{"$f":"IF(ISNUMBER(MATCH(B135,'Grid EFs'!$B$4:$B$157,0)),\"\",\"*\")","v":"*"}]
[null,"Pakistan","Islamic Republic of Pakistan","PK","PK","PAK",586,30,70,"Asia",544.60565217391297,2334.2458999999999,702.83109999999999,579.99519999999995,417.62200000000001,544.60565217391297,4.93,9.0821453399386798E-2,{"$f":"IF(ISNUMBER(MATCH(B136,'Grid EFs'!$B$4:$B$157,0)),\"\",\"*\")","v":""}]
[null,"Palau","Republic of Palau","PS","PW","PLW",585,7.5,134.5,"Oceania",736.13379999999995,1144.2709,843.06479999999999,451.97480000000002,736.13379999999995,"N/A",5.52,5.2001785658027835E-2,{"$f":"IF(ISNUMBER(MATCH(B137,'Grid EFs'!$B$4:$B$157,0)),\"\",\"*\")","v":""}]
[null,"Panama","Republic of Panama","PM","PA","PAN",591,9,-80,"North America",578.70434782608697,1113.2175999999999,813.40959999999995,502.83659999999998,325.59030000000001,578.70434782608697,4.8600000000000003,8.340054595367366E-2,{"$f":"IF(ISNUMBER(MATCH(B138,'Grid EFs'!$B$4:$B$157,0)),\"\",\"*\")","v":"*"}]
[null,"Papua New Guinea","Independent State of Papua New Guinea","PP","PG","PNG",598,-6,147,"Oceania",678.57142857142856,1144.2709,843.06479999999999,451.97480000000002,736.13379999999995,678.57142857142856,5.51,5.2001785658027835E-2,{"$f":"IF(ISNUMBER(MATCH(B139,'Grid EFs'!$B$4:$B$157,0)),\"\",\"*\")","v":""}]
[null,"Paraguay","Republic of Paraguay","PA","PY","PRY",600,-23,-58,"South America",472.44098150782378,1240.4880000000001,671.35590000000002,502.83659999999998,200.8047,472.44098150782378,5.0199999999999996,5.4041871098959984E-2,"*"]
[null,"Peru","Republic of Peru","PE","PE","PER",604,-10,-76,"South America",580.28557692307686,1173.7519,905.29150000000004,586.44259999999997,285.56150000000002,580.28557692307686,4.37,6.4456639702917901E-2,{"$f":"IF(ISNUMBER(MATCH(B141,'Grid EFs'!$B$4:$B$157,0)),\"\",\"*\")","v":"*"}]
[null,"Philippines","Republic of the Philippines","RP","PH","PHL",608,13,122,"Asia",511.56415094339604,936.76829999999995,726.19039999999995,358.52760000000001,502.37360000000001,511.56415094339604,5.07,7.5181041228041534E-2,{"$f":"IF(ISNUMBER(MATCH(B142,'Grid EFs'!$B$4:$B$157,0)),\"\",\"*\")","v":""}]
[null,"Poland","Republic of Poland","PL","PL","POL",616,52,20,"Europe",755.83529999999996,874.21640000000002,484.0102,337.33870000000002,755.83529999999996,"N/A",2.85,5.8177484713456594E-2,{"$f":"IF(ISNUMBER(MATCH(B143,'Grid EFs'!$B$4:$B$157,0)),\"\",\"*\")","v":""}]
[null,"Portugal","Portuguese Republic","PO","PT","PRT",620,39.5,-8,"Europe",363.95909999999998,861.59159999999997,528.9271,351.45780000000002,363.95909999999998,"N/A",4.32,6.5132991732206935E-2,{"$f":"IF(ISNUMBER(MATCH(B144,'Grid EFs'!$B$4:$B$157,0)),\"\",\"*\")","v":""}]
[null,"Qatar","State of Qatar","QA","QA","QAT",634,25.5,51.25,"Asia",{"$f":"IF(P145=\"N/A\",O145,P145)","v":679.18018867924513},1144.2709,915.41219999999998,492.94900000000001,492.94900000000001,679.18018867924513,6.01,5.4999577809971605E-2,{"$f":"IF(ISNUMBER(MATCH(B145,'Grid EFs'!$B$4:$B$157,0)),\"\",\"*\")","v":"*"}]
[null,"Romania","Romania","RO","RO","ROU",642,46,25,"Europe",480.62779999999998,1056.0931,721.27279999999996,393.21120000000002,480.62779999999998,"N/A",3.33,7.724103385949288E-2,{"$f":"IF(ISNUMBER(MATCH(B146,'Grid EFs'!$B$4:$B$157,0)),\"\",\"*\")","v":""}]
[null,"Russia","Russian Federation","RS","RU","RUS",643,60,100,"Europe",428.779,935.50450000000001,801.72310000000004,520.05700000000002,428.779,"N/A",2.86,7.0715108357251089E-2,{"$f":"IF(ISNUMBER(MATCH(B147,'Grid EFs'!$B$4:$B$157,0)),\"\",\"*\")","v":""}]
[null,"Rwanda","Republic of Rwanda","RW","RW","RWA",646,-2,30,"Africa",654,974.53949999999998,833.97270000000003,456.774,597.66229999999996,654,4.88,7.571494692664206E-2,{"$f":"IF(ISNUMBER(MATCH(B148,'Grid EFs'!$B$4:$B$157,0)),\"\",\"*\")","v":""}]
[null,"Saint Kitts and Nevis","Federation of Saint Kitts and Nevis","SC","KN","KNA",659,17.333300000000001,-62.75,"North America",472.44098150782378,1240.4880000000001,671.35590000000002,502.83659999999998,200.8047,472.44098150782378,6.23,5.7679364750868239E-2,{"$f":"IF(ISNUMBER(MATCH(B149,'Grid EFs'!$B$4:$B$157,0)),\"\",\"*\")","v":"*"}]
[null,"Saint Lucia","Saint Lucia","ST","LC","LCA",662,13.8833,-61.133299999999998,"North America",472.44098150782378,1240.4880000000001,671.35590000000002,502.83659999999998,200.8047,472.44098150782378,6.09,5.7679364750868239E-2,{"$f":"IF(ISNUMBER(MATCH(B150,'Grid EFs'!$B$4:$B$157,0)),\"\",\"*\")","v":"*"}]
[null,"Saint Vincent and the Grenadines","Saint Vincent and the Grenadines","VC","VC","VCT",670,13.25,-61.2,"North America",472.44098150782378,1240.4880000000001,671.35590000000002,502.83659999999998,200.8047,472.44098150782378,6.08,5.7679364750868239E-2,{"$f":"IF(ISNUMBER(MATCH(B151,'Grid EFs'!$B$4:$B$157,0)),\"\",\"*\")","v":"*"}]
[null,"Samoa","Independent State of Samoa","WS","WS","WSM",882,-13.583299999999999,-172.33330000000001,"Oceania",736.13379999999995,1144.2709,843.06479999999999,451.97480000000002,736.13379999999995,"N/A",5.26,5.2001785658027835E-2,{"$f":"IF(ISNUMBER(MATCH(B152,'Grid EFs'!$B$4:$B$157,0)),\"\",\"*\")","v":""}]
[null,"San Marino","Republic of San Marino","SM","SM","SMR",674,43.7667,12.416700000000001,"Europe",331.06400000000002,917.48320000000001,690.57929999999999,359.07440000000003,331.06400000000002,"N/A",3.94,5.8109323007447068E-2,{"$f":"IF(ISNUMBER(MATCH(B153,'Grid EFs'!$B$4:$B$157,0)),\"\",\"*\")","v":""}]
[null,"Sao Tome and Principe","Democratic Republic of Sao Tome and Principe","TP","ST","STP",678,1,7,"Africa",720.02358500000003,974.53949999999998,833.97270000000003,456.774,597.66229999999996,720.02358500000003,4.8600000000000003,7.571494692664206E-2,{"$f":"IF(ISNUMBER(MATCH(B154,'Grid EFs'!$B$4:$B$157,0)),\"\",\"*\")","v":""}]
[null,"Saudi Arabia","Kingdom of Saudi Arabia","SA","SA","SAU",682,25,45,"Asia",654,1144.2709,820.30669999999998,636.60609999999997,738.21579999999994,654,5.73,6.3908736846161052E-2,{"$f":"IF(ISNUMBER(MATCH(B155,'Grid EFs'!$B$4:$B$157,0)),\"\",\"*\")","v":"*"}]
[null,"Senegal","Republic of Senegal","SG","SN","SEN",686,14,-14,"Africa",648.37142857142851,974.53949999999998,709.80399999999997,368.42140000000001,601.72170000000006,648.37142857142851,5.74,8.8533399421868941E-2,{"$f":"IF(ISNUMBER(MATCH(B156,'Grid EFs'!$B$4:$B$157,0)),\"\",\"*\")","v":""}]
[null,"Serbia","Republic of Serbia","RI","RS","SRB",688,44,21,"Europe",1099.111373,1031.1309000000001,463.3784,474.06,759.94740000000002,1099.111373,3.59,8.6227193943721442E-2,{"$f":"IF(ISNUMBER(MATCH(B157,'Grid EFs'!$B$4:$B$157,0)),\"\",\"*\")","v":""}]
[null,"Seychelles","Republic of Seychelles","SE","SC","SYC",690,-4.5833000000000004,55.666699999999999,"Africa",720.02358500000003,974.53949999999998,833.97270000000003,456.774,597.66229999999996,720.02358500000003,5.88,7.571494692664206E-2,{"$f":"IF(ISNUMBER(MATCH(B158,'Grid EFs'!$B$4:$B$157,0)),\"\",\"*\")","v":""}]
[null,"Sierra Leone","Republic of Sierra Leone","SL","SL","SLE",694,8.5,-11.5,"Africa",402,974.53949999999998,833.97270000000003,456.774,597.66229999999996,402,5.34,7.571494692664206E-2,{"$f":"IF(ISNUMBER(MATCH(B159,'Grid EFs'!$B$4:$B$157,0)),\"\",\"*\")","v":""}]
[null,"Singapore","Republic of Singapore","SN","SG","SGP",702,1.3667,103.8,"Asia",486.23333333333329,1144.2709,827.18820000000005,398.09429999999998,472.47890000000001,486.23333333333329,4.49,2.8070764025719307E-2,{"$f":"IF(ISNUMBER(MATCH(B160,'Grid EFs'!$B$4:$B$157,0)),\"\",\"*\")","v":""}]
[null,"Slovakia","Slovak Republic","LO","SK","SVK",703,48.666699999999999,19.5,"Europe",194.3861,1043.6219000000001,767.25229999999999,336.15199999999999,194.3861,"N/A",2.86,2.8398567714420182E-2,{"$f":"IF(ISNUMBER(MATCH(B161,'Grid EFs'!$B$4:$B$157,0)),\"\",\"*\")","v":""}]
[null,"Slovenia","Republic of Slovenia","SI","SI","SVN",705,46,15,"Europe",331.47609999999997,952.66920000000005,1041,371.8492,331.47609999999997,"N/A",3.4,4.9546630344902906E-2,{"$f":"IF(ISNUMBER(MATCH(B162,'Grid EFs'!$B$4:$B$157,0)),\"\",\"*\")","v":""}]
[null,"Solomon Islands","Solomon Islands","BP","SB","SLB",90,-8,159,"Oceania",736.13379999999995,1144.2709,843.06479999999999,451.97480000000002,736.13379999999995,"N/A",5.27,5.2001785658027835E-2,{"$f":"IF(ISNUMBER(MATCH(B163,'Grid EFs'!$B$4:$B$157,0)),\"\",\"*\")","v":""}]
[null,"Somalia","Somalia","SO","SO","SOM",706,10,49,"Africa",720.02358500000003,974.53949999999998,833.97270000000003,456.774,597.66229999999996,720.02358500000003,6.13,7.571494692664206E-2,{"$f":"IF(ISNUMBER(MATCH(B164,'Grid EFs'!$B$4:$B$157,0)),\"\",\"*\")","v":""}]
[null,"South Africa","Republic of South Africa","SF","ZA","ZAF",710,-29,24,"Africa",950.57297297297316,972.85919999999999,762.36080000000004,456.774,913.52679999999998,950.57297297297316,5.77,6.5632243029264389E-2,{"$f":"IF(ISNUMBER(MATCH(B165,'Grid EFs'!$B$4:$B$157,0)),\"\",\"*\")","v":""}]
[null,"South Sudan","Republic of South Sudan","OD","SS","SSD",728,8,30,"Africa",720.02358500000003,974.53949999999998,833.97270000000003,456.774,597.66229999999996,720.02358500000003,5.66,5.0847457627118647E-2]
[null,"Spain","Kingdom of Spain","SP","ES","ESP",724,40,-4,"Europe",305.35539999999997,927.68790000000001,708.73649999999998,356.82209999999998,305.35539999999997,"N/A",4.4000000000000004,6.4954149822595675E-2,{"$f":"IF(ISNUMBER(MATCH(B167,'Grid EFs'!$B$4:$B$157,0)),\"\",\"*\")","v":""}]
[null,"Sri Lanka","Democratic Socialist Republic of Sri Lanka","CE","LK","LKA",144,7,81,"Asia",715.41571428571433,1209.5291999999999,677.39149999999995,451.97480000000002,542.09180000000003,715.41571428571433,5.03,8.0096018487556597E-2,{"$f":"IF(ISNUMBER(MATCH(B168,'Grid EFs'!$B$4:$B$157,0)),\"\",\"*\")","v":""}]
[null,"Sudan","Republic of the Sudan","SU","SD","SDN",736,15,30,"Africa",305,974.53949999999998,676.48850000000004,456.774,201.9572,305,6.77,0.22909373784519643,{"$f":"IF(ISNUMBER(MATCH(B169,'Grid EFs'!$B$4:$B$157,0)),\"\",\"*\")","v":""}]
[null,"Suriname","Republic of Suriname","NS","SR","SUR",740,4,-56,"South America",472.44098150782378,1240.4880000000001,671.35590000000002,502.83659999999998,200.8047,472.44098150782378,5.28,8.3808354719636283E-2,{"$f":"IF(ISNUMBER(MATCH(B170,'Grid EFs'!$B$4:$B$157,0)),\"\",\"*\")","v":"*"}]
[null,"Swaziland","Kingdom of Swaziland","WZ","SZ","SWZ",748,-26.5,31.5,"Africa",720.02358500000003,974.53949999999998,833.97270000000003,456.774,597.66229999999996,720.02358500000003,4.8099999999999996,7.571494692664206E-2,{"$f":"IF(ISNUMBER(MATCH(B171,'Grid EFs'!$B$4:$B$157,0)),\"\",\"*\")","v":""}]
[null,"Sweden","Kingdom of Sweden","SW","SE","SWE",752,62,15,"Europe",12.357900000000001,704.76710000000003,398.2251,214.38130000000001,12.357900000000001,"N/A",2.54,5.7607294381684979E-2,{"$f":"IF(ISNUMBER(MATCH(B172,'Grid EFs'!$B$4:$B$157,0)),\"\",\"*\")","v":""}]
[null,"Switzerland","Swiss Confederation","SZ","CH","CHE",756,47,8,"Europe",28.036300000000001,917.48320000000001,424.65320000000003,257.98930000000001,28.036300000000001,"N/A",3.37,5.6305117502635019E-2,{"$f":"IF(ISNUMBER(MATCH(B173,'Grid EFs'!$B$4:$B$157,0)),\"\",\"*\")","v":""}]
[null,"Syria","Syrian Arab Republic","SY","SY","SYR",760,35,38,"Asia",679.18018867924513,1144.2709,801.84029999999996,542.96730000000002,582.41600000000005,679.18018867924513,5,9.0559603936660571E-2,{"$f":"IF(ISNUMBER(MATCH(B174,'Grid EFs'!$B$4:$B$157,0)),\"\",\"*\")","v":"*"}]
[null,"Tajikistan","Republic of Tajikistan","TI","TJ","TJK",762,39,71,"Asia",846.53392083466008,919.05070000000001,785.51969999999994,293.83760000000001,1.2809999999999999,846.53392083466008,4.13,8.4144536558726835E-2,{"$f":"IF(ISNUMBER(MATCH(B175,'Grid EFs'!$B$4:$B$157,0)),\"\",\"*\")","v":""}]
[null,"Tanzania","United Republic of Tanzania","TZ","TZ","TZA",834,-6,35,"Africa",498.3,974.53949999999998,1051.8036,542.39390000000003,486.80590000000001,498.3,6.03,0.10294208145456486,{"$f":"IF(ISNUMBER(MATCH(B176,'Grid EFs'!$B$4:$B$157,0)),\"\",\"*\")","v":""}]
[null,"Thailand","Kingdom of Thailand","TH","TH","THA",764,15,100,"Asia",548.34038461538432,1011.3687,687.81290000000001,409.82740000000001,500.42399999999998,548.34038461538432,5.19,5.491050395418097E-2,{"$f":"IF(ISNUMBER(MATCH(B177,'Grid EFs'!$B$4:$B$157,0)),\"\",\"*\")","v":""}]
[null,"Timor-Leste","Democratic Republic of Timor-Leste","TT","TL","TLS",626,-8.5500000000000007,125.5167,"Oceania",846.53392083466008,1144.2709,843.06479999999999,451.97480000000002,736.13379999999995,846.53392083466008,5.64,5.2001785658027835E-2,{"$f":"IF(ISNUMBER(MATCH(B178,'Grid EFs'!$B$4:$B$157,0)),\"\",\"*\")","v":""}]
[null,"Togo","Togolese Republic","TO","TG","TGO",768,8,1.1667000000000001,"Africa",720.02358500000003,974.53949999999998,1118.4118000000001,456.774,171.28829999999999,720.02358500000003,5.3,7.571494692664206E-2,{"$f":"IF(ISNUMBER(MATCH(B179,'Grid EFs'!$B$4:$B$157,0)),\"\",\"*\")","v":""}]
[null,"Tonga","Kingdom of Tonga","TN","TO","TON",776,-20,-175,"Oceania",736.13379999999995,1144.2709,843.06479999999999,451.97480000000002,736.13379999999995,"N/A",5.39,5.2001785658027835E-2,{"$f":"IF(ISNUMBER(MATCH(B180,'Grid EFs'!$B$4:$B$157,0)),\"\",\"*\")","v":""}]
[null,"Trinidad and Tobago","Republic of Trinidad and Tobago","TD","TT","TTO",780,11,-61,"North America",472.44098150782378,1240.4880000000001,789.54169999999999,676.07249999999999,676.37070000000006,472.44098150782378,6.1,2.7960562547982112E-2,{"$f":"IF(ISNUMBER(MATCH(B181,'Grid EFs'!$B$4:$B$157,0)),\"\",\"*\")","v":"*"}]
[null,"Tunisia","Tunisian Republic","TS","TN","TUN",788,34,9,"Africa",553.64,974.53949999999998,833.97270000000003,473.0899,459.02890000000002,553.64,4.84,8.293450109061215E-2,{"$f":"IF(ISNUMBER(MATCH(B182,'Grid EFs'!$B$4:$B$157,0)),\"\",\"*\")","v":""}]
[null,"Turkey","Republic of Turkey","TU","TR","TUR",792,39,35,"Asia",459.1454,1024.6189999999999,642.71379999999999,373.39429999999999,459.1454,"N/A",4.45,8.5460915686455904E-2,{"$f":"IF(ISNUMBER(MATCH(B183,'Grid EFs'!$B$4:$B$157,0)),\"\",\"*\")","v":""}]
[null,"Turkmenistan","Turkmenistan","TX","TM","TKM",795,40,60,"Asia",846.53392083466008,919.05070000000001,785.51969999999994,986.74469999999997,986.74469999999997,846.53392083466008,4.45,8.1539771090360952E-2,{"$f":"IF(ISNUMBER(MATCH(B184,'Grid EFs'!$B$4:$B$157,0)),\"\",\"*\")","v":""}]
[null,"Tuvalu","Tuvalu","TV","TV","TUV",798,-8,178,"Oceania",736.13379999999995,1144.2709,843.06479999999999,451.97480000000002,736.13379999999995,"N/A",5.31,5.2001785658027835E-2,{"$f":"IF(ISNUMBER(MATCH(B185,'Grid EFs'!$B$4:$B$157,0)),\"\",\"*\")","v":"*"}]
[null,"Uganda","Republic of Uganda","UG","UG","UGA",800,1,32,"Africa",486.73714285714289,974.53949999999998,833.97270000000003,456.774,597.66229999999996,486.73714285714289,5.6,7.571494692664206E-2,{"$f":"IF(ISNUMBER(MATCH(B186,'Grid EFs'!$B$4:$B$157,0)),\"\",\"*\")","v":""}]
[null,"Ukraine","Ukraine","UP","UA","UKR",804,49,32,"Europe",459.97579999999999,1057.3423,750.41110000000003,371.65429999999998,459.97579999999999,"N/A",3.24,7.4604627493893461E-2,{"$f":"IF(ISNUMBER(MATCH(B187,'Grid EFs'!$B$4:$B$157,0)),\"\",\"*\")","v":""}]
[null,"United Arab Emirates","United Arab Emirates","AE","AE","ARE",784,24,54,"Asia",676.37,1144.2709,1195.7221999999999,588.90049999999997,597.27589999999998,676.37,5.61,5.8705113778070299E-2,{"$f":"IF(ISNUMBER(MATCH(B188,'Grid EFs'!$B$4:$B$157,0)),\"\",\"*\")","v":"*"}]
[null,"United Kingdom","United Kingdom of Great Britain and Northern Ireland","UK","GB","GBR",826,54,-2,"Europe",479.47829999999999,892.97889999999995,761.78660000000002,386.89659999999998,479.47829999999999,"N/A",2.61,5.9621438799079995E-2,{"$f":"IF(ISNUMBER(MATCH(B189,'Grid EFs'!$B$4:$B$157,0)),\"\",\"*\")","v":""}]
[null,"United States","United States of America","US","US","USA",840,38,-97,"North America",480.68610000000001,912.45330000000001,671.13300000000004,403.06540000000001,480.68610000000001,"N/A",4.3,5.427651723557974E-2,{"$f":"IF(ISNUMBER(MATCH(B190,'Grid EFs'!$B$4:$B$157,0)),\"\",\"*\")","v":""}]
[null,"Uruguay","Oriental Republic of Uruguay","UY","UY","URY",858,-33,-56,"South America",482.06363636363636,1240.4880000000001,714.87819999999999,496,273.4443,482.06363636363636,4.5999999999999996,7.7533378828687827E-2,{"$f":"IF(ISNUMBER(MATCH(B191,'Grid EFs'!$B$4:$B$157,0)),\"\",\"*\")","v":"*"}]
[null,"Uzbekistan","Republic of Uzbekistan","UZ","UZ","UZB",860,41,64,"Asia",584.5,1565.6724999999999,783.74810000000002,643.07950000000005,546.10950000000003,584.5,4.32,6.5292401988653451E-2,{"$f":"IF(ISNUMBER(MATCH(B192,'Grid EFs'!$B$4:$B$157,0)),\"\",\"*\")","v":""}]
[null,"Vanuatu","Republic of Vanuatu","NH","VU","VUT",548,-16,167,"Oceania",736.13379999999995,1144.2709,843.06479999999999,451.97480000000002,736.13379999999995,"N/A",5.24,5.2001785658027835E-2,{"$f":"IF(ISNUMBER(MATCH(B193,'Grid EFs'!$B$4:$B$157,0)),\"\",\"*\")","v":"*"}]
[null,"Venezuela","Bolivarian Republic of Venezuela","VE","VE","VEN",862,8,-66,"South America",472.44098150782378,1240.4880000000001,942.30510000000004,606.26649999999995,265.3929,472.44098150782378,5.37,9.9701240696059179E-2,{"$f":"IF(ISNUMBER(MATCH(B194,'Grid EFs'!$B$4:$B$157,0)),\"\",\"*\")","v":"*"}]
[null,"Vietnam","Socialist Republic of Vietnam","VM","VN","VNM",704,16,106,"Asia",602.27901209677634,987.55219999999997,1083.2944,403.93900000000002,351.21499999999997,602.27901209677634,4.5199999999999996,6.7640948579374208E-2,{"$f":"IF(ISNUMBER(MATCH(B195,'Grid EFs'!$B$4:$B$157,0)),\"\",\"*\")","v":"*"}]
[null,"Yemen","Republic of Yemen","YM","YE","YEM",887,15,48,"Asia",679.18018867924513,1144.2709,700.92539999999997,551.48310000000004,650.47529999999995,679.18018867924513,6.46,0.10900844576415189,{"$f":"IF(ISNUMBER(MATCH(B196,'Grid EFs'!$B$4:$B$157,0)),\"\",\"*\")","v":"*"}]
[null,"Zambia","Republic of Zambia","ZA","ZM","ZMB",894,-15,30,"Africa",{"$f":"IF(P197=\"N/A\",O197,P197)","v":964.40000000000009},974.53949999999998,871.19439999999997,456.774,2.6467000000000001,964.40000000000009,5.69,8.6568386403383726E-2,{"$f":"IF(ISNUMBER(MATCH(B197,'Grid EFs'!$B$4:$B$157,0)),\"\",\"*\")","v":""}]
[null,"Zimbabwe","Republic of Zimbabwe","ZI","ZW","ZWE",716,-20,30,"Africa",720.02358500000003,903.09500000000003,2116.7406999999998,456.774,365.12180000000001,720.02358500000003,5.71,9.424919000184169E-2,{"$f":"IF(ISNUMBER(MATCH(B198,'Grid EFs'!$B$4:$B$157,0)),\"\",\"*\")","v":""}]
[]
[null,"Country Dataset Sources"]
[null,"Source: US. State Department List of Countries http://www.state.gov/s/inr/rls/4250.htm#note3"]
[null,"Access Date: 10/10/2012"]
[]
[null,"Source: ISO 3166 List of Countries Codes, Lat/Long Coordinate Averages https://opendata.socrata.com/dataset/Country-List-ISO-3166-Codes-Latitude-Longitude/mnkm-8ram"]
[null,"Access Date: 10/25/2012"]
[]
[null,"Source: Country by Continent: http://www.countrycallingcodes.com/iso-country-codes/"]
[null,"Access Date: 10/25/2012"]
[]
[null,"Source: CIA World Factbook - South Sudan Longitude & Latitude https://www.cia.gov/library/publications/the-world-factbook/geos/od.html"]
[null,"Access Date: 3/16/2016"]
[]
[null,"Parameter Sources"]
[null,"Source: NASA http://eosweb.larc.nasa.gov/sse/"]
[null,"NASA Surface meteorology and Solar Energy (SSE) Release 6.0 Data Set (Jan 2008)\n22-year Monthly & Annual Average (July 1983 - June 2005)\nParameter: Insolation Incident On A Horizontal Surface "]
[null,"Access Date: 10/20/2012"]
[]
[null,"Emission Factors:"]
[null,"Source: IGES List of Grid Emission Factor http://pub.iges.or.jp/modules/envirolib/view.php?docid=2136  "]
[null,"Purchase site: http://pub.iges.or.jp/index.html"]
[null,"Access date: 12/22/2022"]
[null,"IGES assembled average Clean Development Mechanism (CDM) combined marginal emission factors for grid electricity for a number of countries.  \n\n \nData used in precendence of IEA data. "]
[]
[null,"Source: IEA CO2 Emissions From Fuel Combustion - Highlights 2013 http://www.iea.org/bookshop/669-CO2_Emissions_from_Fuel_Combustion  \n"]
[null,"Purchase site: http://www.iea.org/bookshop/"]
[null,"Access Date: 12/1/2015"]
[null,"CO2 data was obtained from IEA. Where country or regional marginal emission factors are not available from IGES, grid average emission factors can be found here. "]
[]
[null,"Lineloss"]
[null,"Source: IEA Electricity Information http://www.iea.org/bookshop/645-Electricity_Information_2014"]
[null,"Purchase site: http://data.iea.org/ieastore/product.asp?dept_id=101&pf_id=305"]
[null,"Access Date: 5/15/2015"]
[null,"Lineloss data was derived by country averages from IEA. For countries that did not have this information, regional averages were used instead."]

{"sheet":"Fuel EFs","index":12,"n_rows":70,"n_cols":23,"rows_kept":70,"cut":false,"hidden":true,"merged":[[2,15,4,15],[2,16,3,22]]}
[null,1,2,3,4,5,6,7,8,9,10,11,12,13,14,15,16,17,18,19,20,21,22]
[null,"Default Emission Factors for Stationary Combustion in the Energy Industries"]
[null,null,null,"g of GHG per GJ on a Net Calorific Basis",null,null,null,null,null,null,null,null,null,null,null,"Density (kg/L)","Heating Values & Conversions (GJ/unit)"]
[null,null,null,"CO2",null,null,"CH4",null,null,null,"N2O",null,null,"CO2E"]
[null,"USAID CLEER Tool Name","IPCC Name","Default Emission Factor","Lower","Upper","Default Emission Factor","Lower","Upper","Default Emission Factor","Lower","Upper","Default Emission Factor","Lower","Upper",null,"Tonnes (t)","Gallons (gal)","Liter (L)","Pounds (lbs.)","Kilograms (kg)","Million BTUs (MMBTU)","Therms"]
[null,null,"(intentional blank row)",null,null,null,null,null,null,null,null,null,null,null,null,null,"(GJ/t)","(GJ/gal)","(GJ/L)","(GJ/lbs)","(GJ/kg)","(GJ/MMBTU)","(GJ/Therm)"]
[48,"Biofuel - Biodiesels","Biodiesels",70800,59800,84300,3,1,10,0.6,0.2,2,{"$f":"D7*Conversions!$L$4+'Fuel EFs'!G7*Conversions!$L$5+'Fuel EFs'!J7*Conversions!$L$6","v":71053.8},{"$f":"E7*Conversions!$L$4+'Fuel EFs'!H7*Conversions!$L$5+'Fuel EFs'!K7*Conversions!$L$6","v":59884.6},{"$f":"F7*Conversions!$L$4+'Fuel EFs'!I7*Conversions!$L$5+'Fuel EFs'!L7*Conversions!$L$6","v":85146},null,27,null,null,{"$f":"U7*Conversions!$E$84","v":1.224699399E-2},{"$f":"Q7*Conversions!$F$80","v":2.7E-2},{"$f":"Conversions!$K$58","v":1.055056},{"$f":"Conversions!$K$59","v":0.105506}]
[47,"Biofuel - Biogasoline","Biogasoline",70800,59800,84300,3,1,10,0.6,0.2,2,{"$f":"D8*Conversions!$L$4+'Fuel EFs'!G8*Conversions!$L$5+'Fuel EFs'!J8*Conversions!$L$6","v":71053.8},{"$f":"E8*Conversions!$L$4+'Fuel EFs'!H8*Conversions!$L$5+'Fuel EFs'!K8*Conversions!$L$6","v":59884.6},{"$f":"F8*Conversions!$L$4+'Fuel EFs'!I8*Conversions!$L$5+'Fuel EFs'!L8*Conversions!$L$6","v":85146},null,27,null,null,{"$f":"U8*Conversions!$E$84","v":1.224699399E-2},{"$f":"Q8*Conversions!$F$80","v":2.7E-2},{"$f":"Conversions!$K$58","v":1.055056},{"$f":"Conversions!$K$59","v":0.105506}]
[49,"Biofuel - Other Liquid Biofuels","Other Liquid Biofuels",79600,67100,95300,3,1,10,0.6,0.2,2,{"$f":"D9*Conversions!$L$4+'Fuel EFs'!G9*Conversions!$L$5+'Fuel EFs'!J9*Conversions!$L$6","v":79853.8},{"$f":"E9*Conversions!$L$4+'Fuel EFs'!H9*Conversions!$L$5+'Fuel EFs'!K9*Conversions!$L$6","v":67184.600000000006},{"$f":"F9*Conversions!$L$4+'Fuel EFs'!I9*Conversions!$L$5+'Fuel EFs'!L9*Conversions!$L$6","v":96146},null,27.4,null,null,{"$f":"U9*Conversions!$E$84","v":1.2428430938000001E-2},{"$f":"Q9*Conversions!$F$80","v":2.7400000000000001E-2},{"$f":"Conversions!$K$58","v":1.055056},{"$f":"Conversions!$K$59","v":0.105506}]
[50,"Biogas - Landfill Gas","Landfill Gas",54600,46200,66000,1,0.3,3,0.1,0.03,0.3,{"$f":"D10*Conversions!$L$4+'Fuel EFs'!G10*Conversions!$L$5+'Fuel EFs'!J10*Conversions!$L$6","v":54654.8},{"$f":"E10*Conversions!$L$4+'Fuel EFs'!H10*Conversions!$L$5+'Fuel EFs'!K10*Conversions!$L$6","v":46216.44},{"$f":"F10*Conversions!$L$4+'Fuel EFs'!I10*Conversions!$L$5+'Fuel EFs'!L10*Conversions!$L$6","v":66164.399999999994},null,50.4,null,null,{"$f":"U10*Conversions!$E$84","v":2.2861055448E-2},{"$f":"Q10*Conversions!$F$80","v":5.04E-2},{"$f":"Conversions!$K$58","v":1.055056},{"$f":"Conversions!$K$59","v":0.105506}]
[52,"Biogas - Other Biogas","Other Biogas",54600,46200,66000,1,0.3,3,0.1,0.03,0.3,{"$f":"D11*Conversions!$L$4+'Fuel EFs'!G11*Conversions!$L$5+'Fuel EFs'!J11*Conversions!$L$6","v":54654.8},{"$f":"E11*Conversions!$L$4+'Fuel EFs'!H11*Conversions!$L$5+'Fuel EFs'!K11*Conversions!$L$6","v":46216.44},{"$f":"F11*Conversions!$L$4+'Fuel EFs'!I11*Conversions!$L$5+'Fuel EFs'!L11*Conversions!$L$6","v":66164.399999999994},null,50.4,null,null,{"$f":"U11*Conversions!$E$84","v":2.2861055448E-2},{"$f":"Q11*Conversions!$F$80","v":5.04E-2},{"$f":"Conversions!$K$58","v":1.055056},{"$f":"Conversions!$K$59","v":0.105506}]
[51,"Biogas - Sludge Gas","Sludge Gas",54600,46200,66000,1,0.3,3,0.1,0.03,0.3,{"$f":"D12*Conversions!$L$4+'Fuel EFs'!G12*Conversions!$L$5+'Fuel EFs'!J12*Conversions!$L$6","v":54654.8},{"$f":"E12*Conversions!$L$4+'Fuel EFs'!H12*Conversions!$L$5+'Fuel EFs'!K12*Conversions!$L$6","v":46216.44},{"$f":"F12*Conversions!$L$4+'Fuel EFs'!I12*Conversions!$L$5+'Fuel EFs'!L12*Conversions!$L$6","v":66164.399999999994},null,50.4,null,null,{"$f":"U12*Conversions!$E$84","v":2.2861055448E-2},{"$f":"Q12*Conversions!$F$80","v":5.04E-2},{"$f":"Conversions!$K$58","v":1.055056},{"$f":"Conversions!$K$59","v":0.105506}]
[46,"Biomass - Charcoal","Charcoal",112000,95000,132000,200,70,600,4,1.5,15,{"$f":"D13*Conversions!$L$4+'Fuel EFs'!G13*Conversions!$L$5+'Fuel EFs'!J13*Conversions!$L$6","v":118192},{"$f":"E13*Conversions!$L$4+'Fuel EFs'!H13*Conversions!$L$5+'Fuel EFs'!K13*Conversions!$L$6","v":97197},{"$f":"F13*Conversions!$L$4+'Fuel EFs'!I13*Conversions!$L$5+'Fuel EFs'!L13*Conversions!$L$6","v":151470},null,29.5,null,null,{"$f":"U13*Conversions!$E$84","v":1.3380974915000001E-2},{"$f":"Q13*Conversions!$F$80","v":2.9500000000000002E-2},{"$f":"Conversions!$K$58","v":1.055056},{"$f":"Conversions!$K$59","v":0.105506}]
[45,"Biomass - Other Primary Solid","Other Primary Solid Biomass",100000,84700,117000,30,10,100,4,1.5,15,{"$f":"D14*Conversions!$L$4+'Fuel EFs'!G14*Conversions!$L$5+'Fuel EFs'!J14*Conversions!$L$6","v":101942},{"$f":"E14*Conversions!$L$4+'Fuel EFs'!H14*Conversions!$L$5+'Fuel EFs'!K14*Conversions!$L$6","v":85397},{"$f":"F14*Conversions!$L$4+'Fuel EFs'!I14*Conversions!$L$5+'Fuel EFs'!L14*Conversions!$L$6","v":123970},null,11.6,null,null,{"$f":"U14*Conversions!$E$84","v":5.2616714919999997E-3},{"$f":"Q14*Conversions!$F$80","v":1.1599999999999999E-2},{"$f":"Conversions!$K$58","v":1.055056},{"$f":"Conversions!$K$59","v":0.105506}]
[44,"Biomass - Sulphite lyes (Black Liquor)a","Sulphite lyes (Black Liquor)a",95300,80700,110000,3,1,18,2,1,21,{"$f":"D15*Conversions!$L$4+'Fuel EFs'!G15*Conversions!$L$5+'Fuel EFs'!J15*Conversions!$L$6","v":95971},{"$f":"E15*Conversions!$L$4+'Fuel EFs'!H15*Conversions!$L$5+'Fuel EFs'!K15*Conversions!$L$6","v":81023},{"$f":"F15*Conversions!$L$4+'Fuel EFs'!I15*Conversions!$L$5+'Fuel EFs'!L15*Conversions!$L$6","v":116708},null,11.8,null,null,{"$f":"U15*Conversions!$E$84","v":5.3523899660000013E-3},{"$f":"Q15*Conversions!$F$80","v":1.1800000000000001E-2},{"$f":"Conversions!$K$58","v":1.055056},{"$f":"Conversions!$K$59","v":0.105506}]
[43,"Biomass - Wood / Wood Waste","Wood / Wood Waste",112000,95000,132000,30,10,100,4,1.5,15,{"$f":"D16*Conversions!$L$4+'Fuel EFs'!G16*Conversions!$L$5+'Fuel EFs'!J16*Conversions!$L$6","v":113942},{"$f":"E16*Conversions!$L$4+'Fuel EFs'!H16*Conversions!$L$5+'Fuel EFs'!K16*Conversions!$L$6","v":95697},{"$f":"F16*Conversions!$L$4+'Fuel EFs'!I16*Conversions!$L$5+'Fuel EFs'!L16*Conversions!$L$6","v":138970},null,15.6,null,null,{"$f":"U16*Conversions!$E$84","v":7.076040972E-3},{"$f":"Q16*Conversions!$F$80","v":1.5599999999999999E-2},{"$f":"Conversions!$K$58","v":1.055056},{"$f":"Conversions!$K$59","v":0.105506}]
[15,"Bitumen","Bitumen",80700,73000,89900,3,1,10,0.6,0.2,2,{"$f":"D17*Conversions!$L$4+'Fuel EFs'!G17*Conversions!$L$5+'Fuel EFs'!J17*Conversions!$L$6","v":80953.8},{"$f":"E17*Conversions!$L$4+'Fuel EFs'!H17*Conversions!$L$5+'Fuel EFs'!K17*Conversions!$L$6","v":73084.600000000006},{"$f":"F17*Conversions!$L$4+'Fuel EFs'!I17*Conversions!$L$5+'Fuel EFs'!L17*Conversions!$L$6","v":90746},null,40.200000000000003,null,null,{"$f":"U17*Conversions!$E$84","v":1.8234413274000005E-2},{"$f":"Q17*Conversions!$F$80","v":4.0200000000000007E-2},{"$f":"Conversions!$K$58","v":1.055056},{"$f":"Conversions!$K$59","v":0.105506}]
[36,"Blast Furnace Gas","Blast Furnace Gas",260000,219000,308000,1,0.3,3,0.1,0.03,0.3,{"$f":"D18*Conversions!$L$4+'Fuel EFs'!G18*Conversions!$L$5+'Fuel EFs'!J18*Conversions!$L$6","v":260054.8},{"$f":"E18*Conversions!$L$4+'Fuel EFs'!H18*Conversions!$L$5+'Fuel EFs'!K18*Conversions!$L$6","v":219016.44},{"$f":"F18*Conversions!$L$4+'Fuel EFs'!I18*Conversions!$L$5+'Fuel EFs'!L18*Conversions!$L$6","v":308164.40000000002},null,2.4700000000000002,null,null,{"$f":"U18*Conversions!$E$84","v":1.1203731539000002E-3},{"$f":"Q18*Conversions!$F$80","v":2.4700000000000004E-3},{"$f":"Conversions!$K$58","v":1.055056},{"$f":"Conversions!$K$59","v":0.105506}]
[29,"Brown Coal Briquettes","Brown Coal Briquettes",97500,87300,109000,1,0.3,3,1.5,0.5,5,{"$f":"D19*Conversions!$L$4+'Fuel EFs'!G19*Conversions!$L$5+'Fuel EFs'!J19*Conversions!$L$6","v":97972},{"$f":"E19*Conversions!$L$4+'Fuel EFs'!H19*Conversions!$L$5+'Fuel EFs'!K19*Conversions!$L$6","v":87456.5},{"$f":"F19*Conversions!$L$4+'Fuel EFs'!I19*Conversions!$L$5+'Fuel EFs'!L19*Conversions!$L$6","v":110565},null,20.7,null,null,{"$f":"U19*Conversions!$E$84","v":9.3893620590000011E-3},{"$f":"Q19*Conversions!$F$80","v":2.07E-2},{"$f":"Conversions!$K$58","v":1.055056},{"$f":"Conversions!$K$59","v":0.105506}]
[23,"Coal - Anthracite","Anthracite",98300,94600,101000,1,0.3,3,1.5,0.5,5,{"$f":"D20*Conversions!$L$4+'Fuel EFs'!G20*Conversions!$L$5+'Fuel EFs'!J20*Conversions!$L$6","v":98772},{"$f":"E20*Conversions!$L$4+'Fuel EFs'!H20*Conversions!$L$5+'Fuel EFs'!K20*Conversions!$L$6","v":94756.5},{"$f":"F20*Conversions!$L$4+'Fuel EFs'!I20*Conversions!$L$5+'Fuel EFs'!L20*Conversions!$L$6","v":102565},null,26.7,null,null,{"$f":"U20*Conversions!$E$84","v":1.2110916279000001E-2},{"$f":"Q20*Conversions!$F$80","v":2.6700000000000002E-2},{"$f":"Conversions!$K$58","v":1.055056},{"$f":"Conversions!$K$59","v":0.105506}]
[25,"Coal - Bituminous","Other Bituminous Coal",94600,89500,99700,1,0.3,3,1.5,0.5,5,{"$f":"D21*Conversions!$L$4+'Fuel EFs'!G21*Conversions!$L$5+'Fuel EFs'!J21*Conversions!$L$6","v":95072},{"$f":"E21*Conversions!$L$4+'Fuel EFs'!H21*Conversions!$L$5+'Fuel EFs'!K21*Conversions!$L$6","v":89656.5},{"$f":"F21*Conversions!$L$4+'Fuel EFs'!I21*Conversions!$L$5+'Fuel EFs'!L21*Conversions!$L$6","v":101265},null,25.8,null,null,{"$f":"U21*Conversions!$E$84","v":1.1702683146E-2},{"$f":"Q21*Conversions!$F$80","v":2.58E-2},{"$f":"Conversions!$K$58","v":1.055056},{"$f":"Conversions!$K$59","v":0.105506}]
[24,"Coal - Coking Coal","Coking Coal",94600,87300,101000,1,0.3,3,1.5,0.5,5,{"$f":"D22*Conversions!$L$4+'Fuel EFs'!G22*Conversions!$L$5+'Fuel EFs'!J22*Conversions!$L$6","v":95072},{"$f":"E22*Conversions!$L$4+'Fuel EFs'!H22*Conversions!$L$5+'Fuel EFs'!K22*Conversions!$L$6","v":87456.5},{"$f":"F22*Conversions!$L$4+'Fuel EFs'!I22*Conversions!$L$5+'Fuel EFs'!L22*Conversions!$L$6","v":102565},null,28.2,null,null,{"$f":"U22*Conversions!$E$84","v":1.2791304834000001E-2},{"$f":"Q22*Conversions!$F$80","v":2.8199999999999999E-2},{"$f":"Conversions!$K$58","v":1.055056},{"$f":"Conversions!$K$59","v":0.105506}]
[27,"Coal - Lignite","Lignite",101000,90900,115000,1,0.3,3,1.5,0.5,5,{"$f":"D23*Conversions!$L$4+'Fuel EFs'!G23*Conversions!$L$5+'Fuel EFs'!J23*Conversions!$L$6","v":101472},{"$f":"E23*Conversions!$L$4+'Fuel EFs'!H23*Conversions!$L$5+'Fuel EFs'!K23*Conversions!$L$6","v":91056.5},{"$f":"F23*Conversions!$L$4+'Fuel EFs'!I23*Conversions!$L$5+'Fuel EFs'!L23*Conversions!$L$6","v":116565},null,11.9,null,null,{"$f":"U23*Conversions!$E$84","v":5.3977492030000008E-3},{"$f":"Q23*Conversions!$F$80","v":1.1900000000000001E-2},{"$f":"Conversions!$K$58","v":1.055056},{"$f":"Conversions!$K$59","v":0.105506}]
[26,"Coal - Sub-Bituminous","Sub-Bituminous Coal",96100,92800,100000,1,0.3,3,1.5,0.5,5,{"$f":"D24*Conversions!$L$4+'Fuel EFs'!G24*Conversions!$L$5+'Fuel EFs'!J24*Conversions!$L$6","v":96572},{"$f":"E24*Conversions!$L$4+'Fuel EFs'!H24*Conversions!$L$5+'Fuel EFs'!K24*Conversions!$L$6","v":92956.5},{"$f":"F24*Conversions!$L$4+'Fuel EFs'!I24*Conversions!$L$5+'Fuel EFs'!L24*Conversions!$L$6","v":101565},null,18.899999999999999,null,null,{"$f":"U24*Conversions!$E$84","v":8.5728957930000012E-3},{"$f":"Q24*Conversions!$F$80","v":1.89E-2},{"$f":"Conversions!$K$58","v":1.055056},{"$f":"Conversions!$K$59","v":0.105506}]
[33,"Coal Tar","Coal Tar",80700,68200,95300,1,0.3,3,1.5,0.5,5,{"$f":"D25*Conversions!$L$4+'Fuel EFs'!G25*Conversions!$L$5+'Fuel EFs'!J25*Conversions!$L$6","v":81172},{"$f":"E25*Conversions!$L$4+'Fuel EFs'!H25*Conversions!$L$5+'Fuel EFs'!K25*Conversions!$L$6","v":68356.5},{"$f":"F25*Conversions!$L$4+'Fuel EFs'!I25*Conversions!$L$5+'Fuel EFs'!L25*Conversions!$L$6","v":96865},null,28,null,null,{"$f":"U25*Conversions!$E$84","v":1.270058636E-2},{"$f":"Q25*Conversions!$F$80","v":2.8000000000000001E-2},{"$f":"Conversions!$K$58","v":1.055056},{"$f":"Conversions!$K$59","v":0.105506}]
[31,"Coke - Coke Oven and Lignite","Coke Oven Coke and Lignite Coke",107000,95700,119000,1,0.3,3,1.5,0.5,4,{"$f":"D26*Conversions!$L$4+'Fuel EFs'!G26*Conversions!$L$5+'Fuel EFs'!J26*Conversions!$L$6","v":107472},{"$f":"E26*Conversions!$L$4+'Fuel EFs'!H26*Conversions!$L$5+'Fuel EFs'!K26*Conversions!$L$6","v":95856.5},{"$f":"F26*Conversions!$L$4+'Fuel EFs'!I26*Conversions!$L$5+'Fuel EFs'!L26*Conversions!$L$6","v":120267},null,28.2,null,null,{"$f":"U26*Conversions!$E$84","v":1.2791304834000001E-2},{"$f":"Q26*Conversions!$F$80","v":2.8199999999999999E-2},{"$f":"Conversions!$K$58","v":1.055056},{"$f":"Conversions!$K$59","v":0.105506}]
[32,"Coke - Gas","Gas Coke",107000,95700,119000,1,0.3,3,0.1,0.03,0.3,{"$f":"D27*Conversions!$L$4+'Fuel EFs'!G27*Conversions!$L$5+'Fuel EFs'!J27*Conversions!$L$6","v":107054.8},{"$f":"E27*Conversions!$L$4+'Fuel EFs'!H27*Conversions!$L$5+'Fuel EFs'!K27*Conversions!$L$6","v":95716.44},{"$f":"F27*Conversions!$L$4+'Fuel EFs'!I27*Conversions!$L$5+'Fuel EFs'!L27*Conversions!$L$6","v":119164.4},null,28.2,null,null,{"$f":"U27*Conversions!$E$84","v":1.2791304834000001E-2},{"$f":"Q27*Conversions!$F$80","v":2.8199999999999999E-2},{"$f":"Conversions!$K$58","v":1.055056},{"$f":"Conversions!$K$59","v":0.105506}]
[35,"Coke Oven Gas","Coke Oven Gas",44400,37300,54100,1,0.3,3,0.1,0.03,0.3,{"$f":"D28*Conversions!$L$4+'Fuel EFs'!G28*Conversions!$L$5+'Fuel EFs'!J28*Conversions!$L$6","v":44454.8},{"$f":"E28*Conversions!$L$4+'Fuel EFs'!H28*Conversions!$L$5+'Fuel EFs'!K28*Conversions!$L$6","v":37316.44},{"$f":"F28*Conversions!$L$4+'Fuel EFs'!I28*Conversions!$L$5+'Fuel EFs'!L28*Conversions!$L$6","v":54264.4},null,38.700000000000003,null,null,{"$f":"U28*Conversions!$E$84","v":1.7554024719000003E-2},{"$f":"Q28*Conversions!$F$80","v":3.8700000000000005E-2},{"$f":"Conversions!$K$58","v":1.055056},{"$f":"Conversions!$K$59","v":0.105506}]
[13,"Ethane","Ethane",61600,56500,68600,1,0.3,3,0.1,0.03,0.3,{"$f":"D29*Conversions!$L$4+'Fuel EFs'!G29*Conversions!$L$5+'Fuel EFs'!J29*Conversions!$L$6","v":61654.8},{"$f":"E29*Conversions!$L$4+'Fuel EFs'!H29*Conversions!$L$5+'Fuel EFs'!K29*Conversions!$L$6","v":56516.44},{"$f":"F29*Conversions!$L$4+'Fuel EFs'!I29*Conversions!$L$5+'Fuel EFs'!L29*Conversions!$L$6","v":68764.399999999994},null,46.4,null,null,{"$f":"U29*Conversions!$E$84","v":2.1046685967999999E-2},{"$f":"Q29*Conversions!$F$80","v":4.6399999999999997E-2},{"$f":"Conversions!$K$58","v":1.055056},{"$f":"Conversions!$K$59","v":0.105506}]
[34,"Gas Works Gas","Gas Works Gas",44400,37300,54100,1,0.3,3,0.1,0.03,0.3,{"$f":"D30*Conversions!$L$4+'Fuel EFs'!G30*Conversions!$L$5+'Fuel EFs'!J30*Conversions!$L$6","v":44454.8},{"$f":"E30*Conversions!$L$4+'Fuel EFs'!H30*Conversions!$L$5+'Fuel EFs'!K30*Conversions!$L$6","v":37316.44},{"$f":"F30*Conversions!$L$4+'Fuel EFs'!I30*Conversions!$L$5+'Fuel EFs'!L30*Conversions!$L$6","v":54264.4},null,38.700000000000003,null,null,{"$f":"U30*Conversions!$E$84","v":1.7554024719000003E-2},{"$f":"Q30*Conversions!$F$80","v":3.8700000000000005E-2},{"$f":"Conversions!$K$58","v":1.055056},{"$f":"Conversions!$K$59","v":0.105506}]
[5,"Gasoline - Aviation","Aviation Gasoline",70000,67500,73000,3,1,10,0.6,0.2,2,{"$f":"D31*Conversions!$L$4+'Fuel EFs'!G31*Conversions!$L$5+'Fuel EFs'!J31*Conversions!$L$6","v":70253.8},{"$f":"E31*Conversions!$L$4+'Fuel EFs'!H31*Conversions!$L$5+'Fuel EFs'!K31*Conversions!$L$6","v":67584.600000000006},{"$f":"F31*Conversions!$L$4+'Fuel EFs'!I31*Conversions!$L$5+'Fuel EFs'!L31*Conversions!$L$6","v":73846},0.71,44.3,{"$f":"S31*Conversions!$D$128","v":0.11906256363600001},{"$f":"P31*Conversions!$F$80*Q31","v":3.1453000000000002E-2},{"$f":"U31*Conversions!$E$84","v":2.0094141991E-2},{"$f":"Q31*Conversions!$F$80","v":4.4299999999999999E-2},{"$f":"Conversions!$K$58","v":1.055056},{"$f":"Conversions!$K$59","v":0.105506}]
[6,"Gasoline - Jet","Jet Gasoline",70000,67500,73000,3,1,10,0.6,0.2,2,{"$f":"D32*Conversions!$L$4+'Fuel EFs'!G32*Conversions!$L$5+'Fuel EFs'!J32*Conversions!$L$6","v":70253.8},{"$f":"E32*Conversions!$L$4+'Fuel EFs'!H32*Conversions!$L$5+'Fuel EFs'!K32*Conversions!$L$6","v":67584.600000000006},{"$f":"F32*Conversions!$L$4+'Fuel EFs'!I32*Conversions!$L$5+'Fuel EFs'!L32*Conversions!$L$6","v":73846},null,44.3,null,null,{"$f":"U32*Conversions!$E$84","v":2.0094141991E-2},{"$f":"Q32*Conversions!$F$80","v":4.4299999999999999E-2},{"$f":"Conversions!$K$58","v":1.055056},{"$f":"Conversions!$K$59","v":0.105506}]
[4,"Gasoline - Motor","Motor Gasoline",69300,67500,73000,3,1,10,0.6,0.2,2,{"$f":"D33*Conversions!$L$4+'Fuel EFs'!G33*Conversions!$L$5+'Fuel EFs'!J33*Conversions!$L$6","v":69553.8},{"$f":"E33*Conversions!$L$4+'Fuel EFs'!H33*Conversions!$L$5+'Fuel EFs'!K33*Conversions!$L$6","v":67584.600000000006},{"$f":"F33*Conversions!$L$4+'Fuel EFs'!I33*Conversions!$L$5+'Fuel EFs'!L33*Conversions!$L$6","v":73846},0.74,44.3,{"$f":"S33*Conversions!$D$128","v":0.124093376184},{"$f":"P33*Conversions!$F$80*Q33","v":3.2781999999999999E-2},{"$f":"U33*Conversions!$E$84","v":2.0094141991E-2},{"$f":"Q33*Conversions!$F$80","v":4.4299999999999999E-2},{"$f":"Conversions!$K$58","v":1.055056},{"$f":"Conversions!$K$59","v":0.105506}]
[40,"Industrial Wastes","Industrial Wastes",143000,110000,183000,30,10,100,4,1.5,15,{"$f":"D34*Conversions!$L$4+'Fuel EFs'!G34*Conversions!$L$5+'Fuel EFs'!J34*Conversions!$L$6","v":144942},{"$f":"E34*Conversions!$L$4+'Fuel EFs'!H34*Conversions!$L$5+'Fuel EFs'!K34*Conversions!$L$6","v":110697},{"$f":"F34*Conversions!$L$4+'Fuel EFs'!I34*Conversions!$L$5+'Fuel EFs'!L34*Conversions!$L$6","v":189970},null,"NA",null,null,"NA","NA",{"$f":"Conversions!$K$58","v":1.055056},{"$f":"Conversions!$K$59","v":0.105506}]
[7,"Kerosene - Jet","Jet Kerosene",71500,69700,74400,3,1,10,0.6,0.2,2,{"$f":"D35*Conversions!$L$4+'Fuel EFs'!G35*Conversions!$L$5+'Fuel EFs'!J35*Conversions!$L$6","v":71753.8},{"$f":"E35*Conversions!$L$4+'Fuel EFs'!H35*Conversions!$L$5+'Fuel EFs'!K35*Conversions!$L$6","v":69784.600000000006},{"$f":"F35*Conversions!$L$4+'Fuel EFs'!I35*Conversions!$L$5+'Fuel EFs'!L35*Conversions!$L$6","v":75246},0.79,44.1,{"$f":"S35*Conversions!$D$128","v":0.131879968668},{"$f":"P35*Conversions!$F$80*Q35","v":3.4839000000000002E-2},{"$f":"U35*Conversions!$E$84","v":2.0003423517000001E-2},{"$f":"Q35*Conversions!$F$80","v":4.41E-2},{"$f":"Conversions!$K$58","v":1.055056},{"$f":"Conversions!$K$59","v":0.105506}]
[8,"Kerosene - Other","Other Kerosene",71900,70800,73700,3,1,10,0.6,0.2,2,{"$f":"D36*Conversions!$L$4+'Fuel EFs'!G36*Conversions!$L$5+'Fuel EFs'!J36*Conversions!$L$6","v":72153.8},{"$f":"E36*Conversions!$L$4+'Fuel EFs'!H36*Conversions!$L$5+'Fuel EFs'!K36*Conversions!$L$6","v":70884.600000000006},{"$f":"F36*Conversions!$L$4+'Fuel EFs'!I36*Conversions!$L$5+'Fuel EFs'!L36*Conversions!$L$6","v":74546},0.8,43.8,{"$f":"S36*Conversions!$D$128","v":0.13264083648},{"$f":"P36*Conversions!$F$80*Q36","v":3.5040000000000002E-2},{"$f":"U36*Conversions!$E$84","v":1.9867345806000001E-2},{"$f":"Q36*Conversions!$F$80","v":4.3799999999999999E-2},{"$f":"Conversions!$K$58","v":1.055056},{"$f":"Conversions!$K$59","v":0.105506}]
[12,"Liquefied Petroleum Gases","Liquefied Petroleum Gases",63100,61600,65600,1,0.3,3,0.1,0.03,0.3,{"$f":"D37*Conversions!$L$4+'Fuel EFs'!G37*Conversions!$L$5+'Fuel EFs'!J37*Conversions!$L$6","v":63154.8},{"$f":"E37*Conversions!$L$4+'Fuel EFs'!H37*Conversions!$L$5+'Fuel EFs'!K37*Conversions!$L$6","v":61616.44},{"$f":"F37*Conversions!$L$4+'Fuel EFs'!I37*Conversions!$L$5+'Fuel EFs'!L37*Conversions!$L$6","v":65764.399999999994},0.54,47.3,{"$f":"S37*Conversions!$D$128","v":9.6686993303999991E-2},{"$f":"P37*Conversions!$F$80*Q37","v":2.5541999999999999E-2},{"$f":"U37*Conversions!$E$84","v":2.1454919100999999E-2},{"$f":"Q37*Conversions!$F$80","v":4.7299999999999995E-2},{"$f":"Conversions!$K$58","v":1.055056},{"$f":"Conversions!$K$59","v":0.105506}]
[16,"Lubricants","Lubricants",73300,71900,75200,3,1,10,0.6,0.2,2,{"$f":"D38*Conversions!$L$4+'Fuel EFs'!G38*Conversions!$L$5+'Fuel EFs'!J38*Conversions!$L$6","v":73553.8},{"$f":"E38*Conversions!$L$4+'Fuel EFs'!H38*Conversions!$L$5+'Fuel EFs'!K38*Conversions!$L$6","v":71984.600000000006},{"$f":"F38*Conversions!$L$4+'Fuel EFs'!I38*Conversions!$L$5+'Fuel EFs'!L38*Conversions!$L$6","v":76046},1,40.200000000000003,{"$f":"S38*Conversions!$D$128","v":0.15217356240000002},{"$f":"P38*Conversions!$F$80*Q38","v":4.0200000000000007E-2},{"$f":"U38*Conversions!$E$84","v":1.8234413274000005E-2},{"$f":"Q38*Conversions!$F$80","v":4.0200000000000007E-2},{"$f":"Conversions!$K$58","v":1.055056},{"$f":"Conversions!$K$59","v":0.105506}]
[53,"Municipal Wastes (biomass fraction)","Municipal Wastes (biomass fraction)",100000,84700,117000,30,10,100,4,0.03,15,{"$f":"D39*Conversions!$L$4+'Fuel EFs'!G39*Conversions!$L$5+'Fuel EFs'!J39*Conversions!$L$6","v":101942},{"$f":"E39*Conversions!$L$4+'Fuel EFs'!H39*Conversions!$L$5+'Fuel EFs'!K39*Conversions!$L$6","v":84958.94},{"$f":"F39*Conversions!$L$4+'Fuel EFs'!I39*Conversions!$L$5+'Fuel EFs'!L39*Conversions!$L$6","v":123970},null,11.6,null,null,{"$f":"U39*Conversions!$E$84","v":5.2616714919999997E-3},{"$f":"Q39*Conversions!$F$80","v":1.1599999999999999E-2},{"$f":"Conversions!$K$58","v":1.055056},{"$f":"Conversions!$K$59","v":0.105506}]
[39,"Municipal Wastes (nonbiomass fraction)","Municipal Wastes (nonbiomass fraction)",91700,73300,121000,30,10,100,4,1.5,15,{"$f":"D40*Conversions!$L$4+'Fuel EFs'!G40*Conversions!$L$5+'Fuel EFs'!J40*Conversions!$L$6","v":93642},{"$f":"E40*Conversions!$L$4+'Fuel EFs'!H40*Conversions!$L$5+'Fuel EFs'!K40*Conversions!$L$6","v":73997},{"$f":"F40*Conversions!$L$4+'Fuel EFs'!I40*Conversions!$L$5+'Fuel EFs'!L40*Conversions!$L$6","v":127970},null,10,null,null,{"$f":"U40*Conversions!$E$84","v":4.5359237000000005E-3},{"$f":"Q40*Conversions!$F$80","v":0.01},{"$f":"Conversions!$K$58","v":1.055056},{"$f":"Conversions!$K$59","v":0.105506}]
[14,"Naphtha","Naphtha",73300,69300,76300,3,1,10,0.6,0.2,2,{"$f":"D41*Conversions!$L$4+'Fuel EFs'!G41*Conversions!$L$5+'Fuel EFs'!J41*Conversions!$L$6","v":73553.8},{"$f":"E41*Conversions!$L$4+'Fuel EFs'!H41*Conversions!$L$5+'Fuel EFs'!K41*Conversions!$L$6","v":69384.600000000006},{"$f":"F41*Conversions!$L$4+'Fuel EFs'!I41*Conversions!$L$5+'Fuel EFs'!L41*Conversions!$L$6","v":77146},0.77,44.5,{"$f":"S41*Conversions!$D$128","v":0.12970714218000001},{"$f":"P41*Conversions!$F$80*Q41","v":3.4265000000000004E-2},{"$f":"U41*Conversions!$E$84","v":2.0184860464999999E-2},{"$f":"Q41*Conversions!$F$80","v":4.4499999999999998E-2},{"$f":"Conversions!$K$58","v":1.055056},{"$f":"Conversions!$K$59","v":0.105506}]
[38,"Natural Gas","Natural Gas",56100,54300,58300,1,0.3,3,0.1,0.03,0.3,{"$f":"D42*Conversions!$L$4+'Fuel EFs'!G42*Conversions!$L$5+'Fuel EFs'!J42*Conversions!$L$6","v":56154.8},{"$f":"E42*Conversions!$L$4+'Fuel EFs'!H42*Conversions!$L$5+'Fuel EFs'!K42*Conversions!$L$6","v":54316.44},{"$f":"F42*Conversions!$L$4+'Fuel EFs'!I42*Conversions!$L$5+'Fuel EFs'!L42*Conversions!$L$6","v":58464.4},null,48,null,null,{"$f":"U42*Conversions!$E$84","v":2.1772433760000001E-2},{"$f":"Q42*Conversions!$F$80","v":4.8000000000000001E-2},{"$f":"Conversions!$K$58","v":1.055056},{"$f":"Conversions!$K$59","v":0.105506}]
[3,"Natural Gas Liquids","Natural Gas Liquids",64200,58300,70400,3,1,10,0.6,0.2,2,{"$f":"D43*Conversions!$L$4+'Fuel EFs'!G43*Conversions!$L$5+'Fuel EFs'!J43*Conversions!$L$6","v":64453.8},{"$f":"E43*Conversions!$L$4+'Fuel EFs'!H43*Conversions!$L$5+'Fuel EFs'!K43*Conversions!$L$6","v":58384.6},{"$f":"F43*Conversions!$L$4+'Fuel EFs'!I43*Conversions!$L$5+'Fuel EFs'!L43*Conversions!$L$6","v":71246},0.47,44.2,{"$f":"S43*Conversions!$D$128","v":7.8638148887999998E-2},{"$f":"P43*Conversions!$F$80*Q43","v":2.0774000000000001E-2},{"$f":"U43*Conversions!$E$84","v":2.0048782754000002E-2},{"$f":"Q43*Conversions!$F$80","v":4.4200000000000003E-2},{"$f":"Conversions!$K$58","v":1.055056},{"$f":"Conversions!$K$59","v":0.105506}]
[1,"Oil - Crude","Crude Oil",73300,71100,75500,3,1,10,0.6,0.2,2,{"$f":"D44*Conversions!$L$4+'Fuel EFs'!G44*Conversions!$L$5+'Fuel EFs'!J44*Conversions!$L$6","v":73553.8},{"$f":"E44*Conversions!$L$4+'Fuel EFs'!H44*Conversions!$L$5+'Fuel EFs'!K44*Conversions!$L$6","v":71184.600000000006},{"$f":"F44*Conversions!$L$4+'Fuel EFs'!I44*Conversions!$L$5+'Fuel EFs'!L44*Conversions!$L$6","v":76346},0.8,42.3,{"$f":"S44*Conversions!$D$128","v":0.12809834208000001},{"$f":"P44*Conversions!$F$80*Q44","v":3.3840000000000002E-2},{"$f":"U44*Conversions!$E$84","v":1.9186957251E-2},{"$f":"Q44*Conversions!$F$80","v":4.2299999999999997E-2},{"$f":"Conversions!$K$58","v":1.055056},{"$f":"Conversions!$K$59","v":0.105506}]
[10,"Oil - Gas/Diesel","Gas/Diesel Oil",74100,72600,74800,3,1,10,0.6,0.2,2,{"$f":"D45*Conversions!$L$4+'Fuel EFs'!G45*Conversions!$L$5+'Fuel EFs'!J45*Conversions!$L$6","v":74353.8},{"$f":"E45*Conversions!$L$4+'Fuel EFs'!H45*Conversions!$L$5+'Fuel EFs'!K45*Conversions!$L$6","v":72684.600000000006},{"$f":"F45*Conversions!$L$4+'Fuel EFs'!I45*Conversions!$L$5+'Fuel EFs'!L45*Conversions!$L$6","v":75646},0.84,43,{"$f":"S45*Conversions!$D$128","v":0.13672908144000001},{"$f":"P45*Conversions!$F$80*Q45","v":3.6119999999999999E-2},{"$f":"U45*Conversions!$E$84","v":1.9504471910000001E-2},{"$f":"Q45*Conversions!$F$80","v":4.3000000000000003E-2},{"$f":"Conversions!$K$58","v":1.055056},{"$f":"Conversions!$K$59","v":0.105506}]
[22,"Oil - Other Petroleum","Other Petroleum Products",73300,72200,74400,3,1,10,0.6,0.2,2,{"$f":"D46*Conversions!$L$4+'Fuel EFs'!G46*Conversions!$L$5+'Fuel EFs'!J46*Conversions!$L$6","v":73553.8},{"$f":"E46*Conversions!$L$4+'Fuel EFs'!H46*Conversions!$L$5+'Fuel EFs'!K46*Conversions!$L$6","v":72284.600000000006},{"$f":"F46*Conversions!$L$4+'Fuel EFs'!I46*Conversions!$L$5+'Fuel EFs'!L46*Conversions!$L$6","v":75246},null,40.200000000000003,null,null,{"$f":"U46*Conversions!$E$84","v":1.8234413274000005E-2},{"$f":"Q46*Conversions!$F$80","v":4.0200000000000007E-2},{"$f":"Conversions!$K$58","v":1.055056},{"$f":"Conversions!$K$59","v":0.105506}]
[20,"Oil - Paraffin Waxes","Paraffin Waxes",73300,72200,74400,3,1,10,0.6,0.2,2,{"$f":"D47*Conversions!$L$4+'Fuel EFs'!G47*Conversions!$L$5+'Fuel EFs'!J47*Conversions!$L$6","v":73553.8},{"$f":"E47*Conversions!$L$4+'Fuel EFs'!H47*Conversions!$L$5+'Fuel EFs'!K47*Conversions!$L$6","v":72284.600000000006},{"$f":"F47*Conversions!$L$4+'Fuel EFs'!I47*Conversions!$L$5+'Fuel EFs'!L47*Conversions!$L$6","v":75246},null,40.200000000000003,null,null,{"$f":"U47*Conversions!$E$84","v":1.8234413274000005E-2},{"$f":"Q47*Conversions!$F$80","v":4.0200000000000007E-2},{"$f":"Conversions!$K$58","v":1.055056},{"$f":"Conversions!$K$59","v":0.105506}]
[19,"Oil - Refinery Gas","Refinery Gas",57600,48200,69000,1,0.3,3,0.1,0.03,0.3,{"$f":"D48*Conversions!$L$4+'Fuel EFs'!G48*Conversions!$L$5+'Fuel EFs'!J48*Conversions!$L$6","v":57654.8},{"$f":"E48*Conversions!$L$4+'Fuel EFs'!H48*Conversions!$L$5+'Fuel EFs'!K48*Conversions!$L$6","v":48216.44},{"$f":"F48*Conversions!$L$4+'Fuel EFs'!I48*Conversions!$L$5+'Fuel EFs'!L48*Conversions!$L$6","v":69164.399999999994},null,49.5,null,null,{"$f":"U48*Conversions!$E$84","v":2.2452822315000003E-2},{"$f":"Q48*Conversions!$F$80","v":4.9500000000000002E-2},{"$f":"Conversions!$K$58","v":1.055056},{"$f":"Conversions!$K$59","v":0.105506}]
[11,"Oil - Residual Fuel","Residual Fuel Oil",77400,75500,78800,3,3,30,0.6,0.2,2,{"$f":"D49*Conversions!$L$4+'Fuel EFs'!G49*Conversions!$L$5+'Fuel EFs'!J49*Conversions!$L$6","v":77653.8},{"$f":"E49*Conversions!$L$4+'Fuel EFs'!H49*Conversions!$L$5+'Fuel EFs'!K49*Conversions!$L$6","v":75634.600000000006},{"$f":"F49*Conversions!$L$4+'Fuel EFs'!I49*Conversions!$L$5+'Fuel EFs'!L49*Conversions!$L$6","v":80146},0.94,40.4,{"$f":"S49*Conversions!$D$128","v":0.14375480611199998},{"$f":"P49*Conversions!$F$80*Q49","v":3.7975999999999996E-2},{"$f":"U49*Conversions!$E$84","v":1.8325131748E-2},{"$f":"Q49*Conversions!$F$80","v":4.0399999999999998E-2},{"$f":"Conversions!$K$58","v":1.055056},{"$f":"Conversions!$K$59","v":0.105506}]
[9,"Oil - Shale","Shale Oil",73300,67800,79200,3,1,10,0.6,0.2,2,{"$f":"D50*Conversions!$L$4+'Fuel EFs'!G50*Conversions!$L$5+'Fuel EFs'!J50*Conversions!$L$6","v":73553.8},{"$f":"E50*Conversions!$L$4+'Fuel EFs'!H50*Conversions!$L$5+'Fuel EFs'!K50*Conversions!$L$6","v":67884.600000000006},{"$f":"F50*Conversions!$L$4+'Fuel EFs'!I50*Conversions!$L$5+'Fuel EFs'!L50*Conversions!$L$6","v":80046},1,38.1,{"$f":"S50*Conversions!$D$128","v":0.14422419720000001},{"$f":"P50*Conversions!$F$80*Q50","v":3.8100000000000002E-2},{"$f":"U50*Conversions!$E$84","v":1.7281869297000003E-2},{"$f":"Q50*Conversions!$F$80","v":3.8100000000000002E-2},{"$f":"Conversions!$K$58","v":1.055056},{"$f":"Conversions!$K$59","v":0.105506}]
[21,"Oil - White Spirit and SBP","White Spirit and SBP",73300,72200,74400,3,1,10,0.6,0.2,2,{"$f":"D51*Conversions!$L$4+'Fuel EFs'!G51*Conversions!$L$5+'Fuel EFs'!J51*Conversions!$L$6","v":73553.8},{"$f":"E51*Conversions!$L$4+'Fuel EFs'!H51*Conversions!$L$5+'Fuel EFs'!K51*Conversions!$L$6","v":72284.600000000006},{"$f":"F51*Conversions!$L$4+'Fuel EFs'!I51*Conversions!$L$5+'Fuel EFs'!L51*Conversions!$L$6","v":75246},null,40.200000000000003,null,null,{"$f":"U51*Conversions!$E$84","v":1.8234413274000005E-2},{"$f":"Q51*Conversions!$F$80","v":4.0200000000000007E-2},{"$f":"Conversions!$K$58","v":1.055056},{"$f":"Conversions!$K$59","v":0.105506}]
[28,"Oil Shale and Tar Sands","Oil Shale and Tar Sands",107000,90200,125000,1,0.3,3,1.5,0.5,5,{"$f":"D52*Conversions!$L$4+'Fuel EFs'!G52*Conversions!$L$5+'Fuel EFs'!J52*Conversions!$L$6","v":107472},{"$f":"E52*Conversions!$L$4+'Fuel EFs'!H52*Conversions!$L$5+'Fuel EFs'!K52*Conversions!$L$6","v":90356.5},{"$f":"F52*Conversions!$L$4+'Fuel EFs'!I52*Conversions!$L$5+'Fuel EFs'!L52*Conversions!$L$6","v":126565},null,8.9,null,null,{"$f":"U52*Conversions!$E$84","v":4.0369720929999998E-3},{"$f":"Q52*Conversions!$F$80","v":8.8999999999999999E-3},{"$f":"Conversions!$K$58","v":1.055056},{"$f":"Conversions!$K$59","v":0.105506}]
[2,"Orimulsion","Orimulsion",77000,69300,85400,3,1,10,0.6,0.2,2,{"$f":"D53*Conversions!$L$4+'Fuel EFs'!G53*Conversions!$L$5+'Fuel EFs'!J53*Conversions!$L$6","v":77253.8},{"$f":"E53*Conversions!$L$4+'Fuel EFs'!H53*Conversions!$L$5+'Fuel EFs'!K53*Conversions!$L$6","v":69384.600000000006},{"$f":"F53*Conversions!$L$4+'Fuel EFs'!I53*Conversions!$L$5+'Fuel EFs'!L53*Conversions!$L$6","v":86246},null,27.5,null,null,{"$f":"U53*Conversions!$E$84","v":1.2473790175000001E-2},{"$f":"Q53*Conversions!$F$80","v":2.75E-2},{"$f":"Conversions!$K$58","v":1.055056},{"$f":"Conversions!$K$59","v":0.105506}]
[37,"Oxygen Steel Furnace Gas","Oxygen Steel Furnace Gas",182000,145000,202000,1,0.3,3,0.1,0.03,0.3,{"$f":"D54*Conversions!$L$4+'Fuel EFs'!G54*Conversions!$L$5+'Fuel EFs'!J54*Conversions!$L$6","v":182054.8},{"$f":"E54*Conversions!$L$4+'Fuel EFs'!H54*Conversions!$L$5+'Fuel EFs'!K54*Conversions!$L$6","v":145016.44},{"$f":"F54*Conversions!$L$4+'Fuel EFs'!I54*Conversions!$L$5+'Fuel EFs'!L54*Conversions!$L$6","v":202164.4},null,7.06,null,null,{"$f":"U54*Conversions!$E$84","v":3.2023621321999999E-3},{"$f":"Q54*Conversions!$F$80","v":7.0599999999999994E-3},{"$f":"Conversions!$K$58","v":1.055056},{"$f":"Conversions!$K$59","v":0.105506}]
[30,"Patent Fuel","Patent Fuel",97500,87300,109000,1,0.3,3,1.5,0.5,5,{"$f":"D55*Conversions!$L$4+'Fuel EFs'!G55*Conversions!$L$5+'Fuel EFs'!J55*Conversions!$L$6","v":97972},{"$f":"E55*Conversions!$L$4+'Fuel EFs'!H55*Conversions!$L$5+'Fuel EFs'!K55*Conversions!$L$6","v":87456.5},{"$f":"F55*Conversions!$L$4+'Fuel EFs'!I55*Conversions!$L$5+'Fuel EFs'!L55*Conversions!$L$6","v":110565},null,20.7,null,null,{"$f":"U55*Conversions!$E$84","v":9.3893620590000011E-3},{"$f":"Q55*Conversions!$F$80","v":2.07E-2},{"$f":"Conversions!$K$58","v":1.055056},{"$f":"Conversions!$K$59","v":0.105506}]
[42,"Peat","Peata",106000,100000,108000,1,0.3,3,1.5,0.5,5,{"$f":"D56*Conversions!$L$4+'Fuel EFs'!G56*Conversions!$L$5+'Fuel EFs'!J56*Conversions!$L$6","v":106472},{"$f":"E56*Conversions!$L$4+'Fuel EFs'!H56*Conversions!$L$5+'Fuel EFs'!K56*Conversions!$L$6","v":100156.5},{"$f":"F56*Conversions!$L$4+'Fuel EFs'!I56*Conversions!$L$5+'Fuel EFs'!L56*Conversions!$L$6","v":109565},null,9.76,null,null,{"$f":"U56*Conversions!$E$84","v":4.4270615312000001E-3},{"$f":"Q56*Conversions!$F$80","v":9.7599999999999996E-3},{"$f":"Conversions!$K$58","v":1.055056},{"$f":"Conversions!$K$59","v":0.105506}]
[17,"Petroleum Coke","Petroleum Coke",97500,82900,115000,3,1,10,0.6,0.2,2,{"$f":"D57*Conversions!$L$4+'Fuel EFs'!G57*Conversions!$L$5+'Fuel EFs'!J57*Conversions!$L$6","v":97753.8},{"$f":"E57*Conversions!$L$4+'Fuel EFs'!H57*Conversions!$L$5+'Fuel EFs'!K57*Conversions!$L$6","v":82984.600000000006},{"$f":"F57*Conversions!$L$4+'Fuel EFs'!I57*Conversions!$L$5+'Fuel EFs'!L57*Conversions!$L$6","v":115846},null,32.5,null,null,{"$f":"U57*Conversions!$E$84","v":1.4741752025000001E-2},{"$f":"Q57*Conversions!$F$80","v":3.2500000000000001E-2},{"$f":"Conversions!$K$58","v":1.055056},{"$f":"Conversions!$K$59","v":0.105506}]
[18,"Refinery Feedstocks","Refinery Feedstocks",73300,68900,76600,3,1,10,0.6,0.2,2,{"$f":"D58*Conversions!$L$4+'Fuel EFs'!G58*Conversions!$L$5+'Fuel EFs'!J58*Conversions!$L$6","v":73553.8},{"$f":"E58*Conversions!$L$4+'Fuel EFs'!H58*Conversions!$L$5+'Fuel EFs'!K58*Conversions!$L$6","v":68984.600000000006},{"$f":"F58*Conversions!$L$4+'Fuel EFs'!I58*Conversions!$L$5+'Fuel EFs'!L58*Conversions!$L$6","v":77446},null,43,null,null,{"$f":"U58*Conversions!$E$84","v":1.9504471910000001E-2},{"$f":"Q58*Conversions!$F$80","v":4.3000000000000003E-2},{"$f":"Conversions!$K$58","v":1.055056},{"$f":"Conversions!$K$59","v":0.105506}]
[41,"Waste Oils","Waste Oils",73300,72200,74400,30,10,100,4,1.5,15,{"$f":"D59*Conversions!$L$4+'Fuel EFs'!G59*Conversions!$L$5+'Fuel EFs'!J59*Conversions!$L$6","v":75242},{"$f":"E59*Conversions!$L$4+'Fuel EFs'!H59*Conversions!$L$5+'Fuel EFs'!K59*Conversions!$L$6","v":72897},{"$f":"F59*Conversions!$L$4+'Fuel EFs'!I59*Conversions!$L$5+'Fuel EFs'!L59*Conversions!$L$6","v":81370},null,40.200000000000003,null,null,{"$f":"U59*Conversions!$E$84","v":1.8234413274000005E-2},{"$f":"Q59*Conversions!$F$80","v":4.0200000000000007E-2},{"$f":"Conversions!$K$58","v":1.055056},{"$f":"Conversions!$K$59","v":0.105506}]
[null,"a Includes the biomass-derived CO2 emitted from the black liquor combustion unit and the biomass-derived CO2 emitted from the kraft mill lime kiln."]
[]
[null,"Sources "]
[null,"Fuel Emission Factors: 2006 IPCC Guidelines for  National Greenhouse Gas Inventories - Chapter 2: Stationary Combustion."]
[null,"Table 2.2 - Default Emission Factors for Stationary Combustion in the Energy Industries (kg of greenhouse gas per TJ on a Net Calorific Basis)"]
[null,"Note: Units converted to g of GHG per GJ for purposes of this tool"]
[null,"Heating Value Factors: 2006 IPCC Guidelines for  National Greenhouse Gas Inventories - Chapter 1: Introduction"]
[null,"Tables 1.2 - Default Net Calorific Values (NCVs) in TJ per Gg"]
[null,"Note: Units converted to GJ of energy per metric ton (mt) for purposes of this tool"]
[null,"Fuel Density Factors: World Resources Institute - GHG Protocol for Stationary Combustion, 2005."]
[null,"Emission factors from Cross-cutting tools. Table 1.1 CO2 emission factors by fuel"]

{"sheet":"Grid EFs","index":13,"n_rows":223,"n_cols":14,"rows_kept":223,"cut":false,"hidden":true,"merged":[[222,1,224,5],[2,8,2,11],[2,12,2,13],[220,1,220,5]]}
[]
[null,"IEA CO2 From Fossil Fuel  - Grams CO2/kWh (2012)",null,null,null,null,null,"Regional Averages"]
["IEA Names","Region/Country/Economy","Grid Average","Coal/Peat","Oil","Natural Gas",null,null,"IEA",null,null,null,"IGES"]
["Canada","Canada",150.88890000000001,900.98339999999996,882.01819999999998,475.46699999999998,null,"Region","Average of Grams CO2","Coal/Peat","Oil","Natural Gas","Region","CDM CM (IGES)"]
["Chile","Chile",599.67925000000048,868.79169999999999,984.12059999999997,438.09780000000001,null,"Africa",597.66229999999996,974.53949999999998,833.97270000000003,456.774,"Africa",713.78507792207802]
["Mexico","Mexico",529.39173553718979,963.50099999999998,696.73030000000006,406.79509999999999,null,"Asia",736.13379999999995,1144.2709,843.06479999999999,451.97480000000002,"Asia",852.140056482962]
["United States","United States",480.68610000000001,912.45330000000001,671.13300000000004,403.06540000000001,null,"Europe",331.06400000000002,917.48320000000001,690.57929999999999,359.07440000000003,"Europe and Eurasia","N/A"]
[null,"OECD Americas",440.16149638429761,911.43235000000004,808.50052499999993,430.85632499999997]
[null,"Australia",798.90189999999996,993.75379999999996,679.18949999999995,522.1739,null,"North America",439.49040000000002,912.40520000000004,718.42819999999995,407.01139999999998,"North America","N/A"]
["Australia","Israel",705.11789473684212,851.55619999999999,869.50779999999997,364.53910000000002,null,"Oceania",578.45060000000001,931.32029999999997,633.54280000000006,439.2518,"Pacific Islands","N/A"]
["Israel","Japan",852.140056482962,908.60310000000004,613.74609999999996,437.642,null,"South America",200.8047,1240.4880000000001,671.35590000000002,502.83659999999998,"Latin America and the Caribbean",472.65132124352402]
["Japan","Korea, South",911.65,924.70600000000002,649.11210000000005,419.58620000000002]
["Korea","New Zealand",173.28200000000001,1127.9532999999999,1040.6667,411.54259999999999]
["OECD Asia Oceania","OECD Asia Oceania",688.21837024396086,961.31448,770.44443999999987,431.09676000000002]
["Austria","Austria",164.791,1057.8384000000001,578.3732,320.45830000000001]
["Belgium","Belgium",212.018,1318.2679000000001,507.5213,313.30309999999997]
["Czech Republic","Czech Republic",551.84950000000003,1008.5516,925.98440000000005,419.25749999999999]
["Denmark","Denmark",257.26420000000002,579.9076,602.43290000000002,270.12759999999997]
["Estonia","Estonia",911.99310000000003,1050.2034000000001,840.80529999999999,240.0607]
["Finland","Finland",134.1499,661.47760000000005,570.2242,241.48099999999999]
["France","France",69.254199999999997,1046.1799000000001,623.31330000000003,457.6925]
["Germany","Germany",475.40809999999999,894.91300000000001,606.77779999999996,331.24009999999998]
["Greece","Greece",684.61030000000005,1024.2320999999999,737.72590000000002,387.5806]
["Hungary","Hungary",314.01240000000001,1085.4237000000001,851.28489999999999,370.63900000000001]
["Iceland","Iceland",0.1779,917.48320000000001,1040.6667,359.07440000000003]
["Ireland","Ireland",456.58359999999999,857.84320000000002,710.49,385.3494]
["Italy","Italy",385.04079999999999,900.39570000000003,757.4991,370.93520000000001]
["Luxembourg","Luxembourg",340.3408,917.48320000000001,690.57929999999999,357.65460000000002]
["Netherlands","Netherlands",440.69659999999999,912.89919999999995,703.0788,300.13510000000002]
["Norway","Norway",8.0572999999999997,1191.7299,304.37299999999999,338.78710000000001]
["Poland","Poland",755.83529999999996,874.21640000000002,484.0102,337.33870000000002]
["Portugal","Portugal",363.95909999999998,861.59159999999997,528.9271,351.45780000000002]
["Slovak Republic","Slovakia",194.3861,1043.6219000000001,767.25229999999999,336.15199999999999]
["Slovenia","Slovenia",331.47609999999997,952.66920000000005,1041,371.8492]
["Spain","Spain",305.35539999999997,927.68790000000001,708.73649999999998,356.82209999999998]
["Sweden","Sweden",12.357900000000001,704.76710000000003,398.2251,214.38130000000001]
["Switzerland","Switzerland",28.036300000000001,917.48320000000001,424.65320000000003,257.98930000000001]
["Turkey","Turkey",459.1454,1024.6189999999999,642.71379999999999,373.39429999999999]
["United Kingdom","United Kingdom",479.47829999999999,892.97889999999995,761.78660000000002,386.89659999999998]
["OECD Europe","OECD Europe",333.45110400000004,944.97859199999994,672.33739600000001,338.00230000000005]
["Albania","Albania",393.40000000000003,919.05070000000001,785.51969999999994,527.41980000000001]
["Armenia","Andorra",331.06400000000002,917.48320000000001,690.57929999999999,359.07440000000003]
["Azerbaijan","Armenia",435.9666666666667,919.05070000000001,785.51969999999994,417.32839999999999]
["Belarus","Azerbaijan",589.7600000000001,919.05070000000001,627.95230000000004,533.89710000000002]
["Bosnia and Herzegovina","Belarus",425.11810000000003,1487.011,583.20280000000002,422.51690000000002]
["Bulgaria","Bosnia and Herzegovina",973.15,1395.2871,765.82140000000004,694.42309999999998]
["Croatia","Bulgaria",531.69439999999997,1042.7764,782.32849999999996,311.90859999999998]
["Cyprus","Croatia",311.06299999999999,868.73990000000003,638.58630000000005,365.64839999999998]
["Georgia","Cyprus",798.22,919.05070000000001,768.14729999999997,527.41980000000001]
["Kazakhstan","Georgia",402.46600000000001,919.05070000000001,785.51969999999994,458.91669999999999]
["Kosovo","Holy See",331.06400000000002,917.48320000000001,690.57929999999999,359.07440000000003]
["Kyrgyzstan","Kazakhstan",852.140056482962,491.55970000000002,301.59410000000003,573.98879999999997]
["Latvia","Kosovo",1026.3259,1040.9362000000001,1110.4793999999999,527.41980000000001]
["Lithuania","Kyrgyzstan",852.140056482962,443.45170000000002,936.13329999999996,448.21289999999999]
["FYR of Macedonia","Latvia",91.083699999999993,919.05070000000001,702.46960000000001,256.64830000000001]
["Malta","Liechtenstein",331.06400000000002,917.48320000000001,690.57929999999999,359.07440000000003]
["Republic of Moldova","Lithuania",271.19240000000002,919.05070000000001,916.47770000000003,350.495]
["Montenegro","Macedonia, FYR",861.23333333333335,1069.4612,800.75,351.517]
["Romania","Malta",871.5258,919.05070000000001,881.14530000000002,527.41980000000001]
["Russian Federation","Moldova",497.12479999999999,919.05070000000001,785.51969999999994,521.75530000000003]
["Serbia","Monaco",331.06400000000002,917.48320000000001,690.57929999999999,359.07440000000003]
["Tajikistan","Montenegro",983.6,1132.5757000000001,785.51969999999994,527.41980000000001]
["Turkmenistan","Romania",480.62779999999998,1056.0931,721.27279999999996,393.21120000000002]
["Ukraine","Russia",428.779,935.50450000000001,801.72310000000004,520.05700000000002]
[null,"San Marino",331.06400000000002,917.48320000000001,690.57929999999999,359.07440000000003]
[null,"Serbia",1099.111373,1031.1309000000001,463.3784,474.06]
[null,"Tajikistan",852.140056482962,919.05070000000001,785.51969999999994,293.83760000000001]
[null,"Turkmenistan",852.140056482962,919.05070000000001,785.51969999999994,986.74469999999997]
[null,"Ukraine",459.97579999999999,1057.3423,750.41110000000003,371.65429999999998]
["Uzbekistan","Uzbekistan",593,1565.6724999999999,783.74810000000002,643.07950000000005]
["Non-OECD Europe and Eurasia","Non-OECD Europe and Eurasia",586.27660996439488,977.15052999999966,742.90519666666694,460.7457266666666]
[null,"Algeria",713.78507792207802,974.53949999999998,935.38210000000004,528.50840000000005]
[null,"Angola",840.8,974.53949999999998,1343.4219000000001,456.774]
[null,"Benin",713.78507792207802,974.53949999999998,725.1481,456.774]
[null,"Botswana",713.78507792207802,1478.836,833.97270000000003,456.774]
[null,"Burkina Faso",368.25,974.53949999999998,833.97270000000003,456.774]
[null,"Burundi",713.78507792207802,974.53949999999998,833.97270000000003,456.774]
[null,"Cameroon",713.78507792207802,974.53949999999998,859.74220000000003,537.85019999999997]
[null,"Cape Verde",713.78507792207802,974.53949999999998,833.97270000000003,456.774]
[null,"Central African Republic",713.78507792207802,974.53949999999998,833.97270000000003,456.774]
[null,"Chad",713.78507792207802,974.53949999999998,833.97270000000003,456.774]
[null,"Comoros",713.78507792207802,974.53949999999998,833.97270000000003,456.774]
[null,"Congo",713.78507792207802,974.53949999999998,1058.4444000000001,584.13869999999997]
[null,"Congo, Democratic Republic",713.78507792207802,974.53949999999998,1058.1667,573.20690000000002]
[null,"Côte d'Ivoire",660.37499999999989,974.53949999999998,928.70090000000005,642.93790000000001]
[null,"Djibouti",713.78507792207802,974.53949999999998,833.97270000000003,456.774]
[null,"Egypt",538.90999999999985,974.53949999999998,834.98019999999997,418.28910000000002]
[null,"Equatorial Guinea",713.78507792207802,974.53949999999998,833.97270000000003,456.774]
[null,"Eritrea",713.78507792207802,974.53949999999998,854.09799999999996,456.774]
[null,"Ethiopia",713.78507792207802,974.53949999999998,1111.2750000000001,456.774]
[null,"Gabon",713.78507792207802,974.53949999999998,714.58309999999994,763.5163]
[null,"Gambia, The",713.78507792207802,974.53949999999998,833.97270000000003,456.774]
[null,"Ghana",478.51500000000004,974.53949999999998,869.63149999999996,566.91849999999999]
[null,"Guinea",713.78507792207802,974.53949999999998,833.97270000000003,456.774]
[null,"Guinea-Bissau",713.78507792207802,974.53949999999998,833.97270000000003,456.774]
[null,"Kenya",603.23384615384612,974.53949999999998,898.12819999999999,456.774]
[null,"Lesotho",713.78507792207802,974.53949999999998,833.97270000000003,456.774]
[null,"Liberia",713.78507792207802,974.53949999999998,833.97270000000003,456.774]
["Algeria","Libya",793.7,974.53949999999998,858.23180000000002,383.43419999999998]
["Angola","Madagascar",552,974.53949999999998,833.97270000000003,456.774]
["Benin","Malawi",713.78507792207802,974.53949999999998,833.97270000000003,456.774]
["Botswana","Mali",582.20000000000005,974.53949999999998,833.97270000000003,456.774]
["Cameroon","Mauritania",713.78507792207802,974.53949999999998,833.97270000000003,456.774]
["Congo","Mauritius",975.25,974.53949999999998,833.97270000000003,456.774]
["Dem. Rep. of Congo","Morocco",660.76433333333341,986.82029999999997,723.58849999999995,376.73469999999998]
["Côte d'Ivoire","Mozambique",713.78507792207802,974.53949999999998,833.97270000000003,853.80949999999996]
["Egypt","Namibia",920,1402.5333000000001,1110.3333,456.774]
["Eritrea","Niger",713.78507792207802,974.53949999999998,833.97270000000003,456.774]
["Ethiopia","Nigeria",573.28,974.53949999999998,833.97270000000003,502.23219999999998]
["Gabon","Rwanda",654,974.53949999999998,833.97270000000003,456.774]
["Ghana","Sao Tome and Principe",713.78507792207802,974.53949999999998,833.97270000000003,456.774]
["Kenya","Senegal",682.60000000000014,974.53949999999998,709.80399999999997,368.42140000000001]
["Libya","Seychelles",713.78507792207802,974.53949999999998,833.97270000000003,456.774]
["Morocco","Sierra Leone",402,974.53949999999998,833.97270000000003,456.774]
["Mozambique","Somalia",713.78507792207802,974.53949999999998,833.97270000000003,456.774]
["Namibia","South Africa",954.52702702702732,972.85919999999999,762.36080000000004,456.774]
["Nigeria","South Sudan",713.78507792207802,974.53949999999998,833.97270000000003,456.774]
["Senegal","Sudan",305,974.53949999999998,676.48850000000004,456.774]
["South Africa","Swaziland",713.78507792207802,974.53949999999998,833.97270000000003,456.774]
["Sudan","Tanzania",529,974.53949999999998,1051.8036,542.39390000000003]
["United Rep. of Tanzania","Togo",713.78507792207802,974.53949999999998,1118.4118000000001,456.774]
["Togo","Tunisia",553.64,974.53949999999998,833.97270000000003,473.0899]
["Tunisia","Uganda",529.02666666666664,974.53949999999998,833.97270000000003,456.774]
["Zambia","Zambia",713.78507792207802,974.53949999999998,871.19439999999997,456.774]
["Zimbabwe","Zimbabwe",713.78507792207802,903.09500000000003,2116.7406999999998,456.774]
["Other Africa","Africa",679.85147119647138,990.67739444444396,889.70024814814803,480.17903333333339]
["Africa","Afghanistan",852.140056482962,919.05070000000001,785.51969999999994,527.41980000000001]
["Bangladesh","Bangladesh",640.68500000000006,1037.0159000000001,598.72649999999999,572.85310000000004]
[null,"Bhutan",779,1144.2709,843.06479999999999,451.97480000000002]
[null,"Brunei Darussalam",852.140056482962,1144.2709,858.10810000000004,721.75040000000001]
[null,"Burma",713.40000000000009,939.99220000000003,809.33330000000001,724.95759999999996]
[null,"Cambodia",665.06000000000006,1062.6486,839.21820000000002,451.97480000000002]
[null,"Fiji",596.49999999999989,1144.2709,843.06479999999999,451.97480000000002]
[null,"India",898.57717075366929,1218.9636,1098.298,440.04199999999997]
[null,"Indonesia",757.73934426229505,1111.7001,869.32550000000003,529.69830000000002]
[null,"Kiribati",736.13379999999995,1144.2709,843.06479999999999,451.97480000000002]
[null,"Korea, North",631.58224390243925,1255.8557000000001,1380.2612999999999,451.97480000000002]
[null,"Korea, North",631.58224390243925,1255.8557000000001,1380.2612999999999,451.97480000000002]
[null,"Laos",554.04999999999995,1144.2709,843.06479999999999,451.97480000000002]
[null,"Malaysia",668.08048780487843,983.67769999999996,720.28020000000004,494.76960000000003]
[null,"Maldives",852.140056482962,1144.2709,843.06479999999999,451.97480000000002]
[null,"Marshall Islands",736.13379999999995,1144.2709,843.06479999999999,451.97480000000002]
[null,"Micronesia, Federated States of",736.13379999999995,1144.2709,843.06479999999999,451.97480000000002]
[null,"Mongolia",1061,875.55420000000004,1038.2815000000001,451.97480000000002]
[null,"Nauru",736.13379999999995,1144.2709,843.06479999999999,451.97480000000002]
[null,"Nepal",852.140056482962,1144.2709,712.94740000000002,451.97480000000002]
["Brunei Darussalam","Pakistan",540.25999999999988,2334.2458999999999,702.83109999999999,579.99519999999995]
["Cambodia","Palau",736.13379999999995,1144.2709,843.06479999999999,451.97480000000002]
["Chinese Taipei","Papua New Guinea",678.57142857142856,1144.2709,843.06479999999999,451.97480000000002]
["India","Philippines",510.89444444444422,936.76829999999995,726.19039999999995,358.52760000000001]
["Indonesia","Samoa",736.13379999999995,1144.2709,843.06479999999999,451.97480000000002]
["DPR of Korea","Singapore",486.23333333333329,1144.2709,827.18820000000005,398.09429999999998]
["Malaysia","Solomon Islands",736.13379999999995,1144.2709,843.06479999999999,451.97480000000002]
["Mongolia","Sri Lanka",690.78499999999997,1209.5291999999999,677.39149999999995,451.97480000000002]
["Myanmar","Thailand",547.4492248062013,1011.3687,687.81290000000001,409.82740000000001]
["Nepal","Timor-Leste",852.140056482962,1144.2709,843.06479999999999,451.97480000000002]
["Pakistan","Tonga",736.13379999999995,1144.2709,843.06479999999999,451.97480000000002]
["Philippines","Tuvalu",736.13379999999995,1144.2709,843.06479999999999,451.97480000000002]
["Singapore","Vanuatu",736.13379999999995,1144.2709,843.06479999999999,451.97480000000002]
["Sri Lanka","Vietnam",563.75861224489984,987.55219999999997,1083.2944,403.93900000000002]
["Thailand","Asia",712.86020048355408,1143.5566411764703,861.30312647058827,473.68587941176469]
["Vietnam","Antigua and Barbuda",472.65132124352402,1240.4880000000001,671.35590000000002,502.83659999999998]
["Other Asia","Argentina",521.49441176470577,1165.1775,731.76139999999998,476.05540000000002]
["Asia","Bahamas, The",723,1240.4880000000001,671.35590000000002,502.83659999999998]
["People's Rep. of China","Barbados",472.65132124352402,1240.4880000000001,671.35590000000002,502.83659999999998]
["Hong Kong, China","Belize",151.9,1240.4880000000001,671.35590000000002,502.83659999999998]
["China","Bolivia",711,1240.4880000000001,942.25810000000001,634.07849999999996]
["Argentina","Brazil",298.76581203007527,1409.4494,726.96900000000005,428.30650000000003]
["Bolivia","China",884.35902390290642,948.2106,755.21159999999998,508.38440000000003]
["Brazil","Colombia",332.58833333333331,959.6617,921.27110000000005,451.85820000000001]
["Colombia","Costa Rica",280.6957142857143,1240.4880000000001,666.34820000000002,502.83659999999998]
["Costa Rica","Cuba",873.5,1240.4880000000001,989.4932,502.23230000000001]
["Cuba","Dominica",472.65132124352402,1240.4880000000001,671.35590000000002,502.83659999999998]
["Dominican Republic","Dominican Republic",654.14285714285711,953.69870000000003,616.92409999999995,458.23329999999999]
["Ecuador","Ecuador",590.21607142857135,1240.4880000000001,752.96360000000004,490.99270000000001]
[null,"El Salvador",677.65555555555557,1240.4880000000001,662.95349999999996,502.83659999999998]
[null,"Grenada",472.65132124352402,1240.4880000000001,671.35590000000002,502.83659999999998]
[null,"Guatemala",651.32105263157882,960.22540000000004,640.81590000000006,502.83659999999998]
[null,"Guyana",948.30000000000007,1240.4880000000001,671.35590000000002,502.83659999999998]
[null,"Haiti",472.65132124352402,1240.4880000000001,687.30100000000004,502.83659999999998]
[null,"Honduras",665.5344827586207,927.07749999999999,637.28480000000002,502.83659999999998]
[null,"Jamaica",783.2,1240.4880000000001,704.72829999999999,502.83659999999998]
[null,"Nicaragua",689.90000000000009,1240.4880000000001,711.10929999999996,502.83659999999998]
[null,"Panama",606.80000000000007,1113.2175999999999,813.40959999999995,502.83659999999998]
[null,"Paraguay",472.65132124352402,1240.4880000000001,671.35590000000002,502.83659999999998]
[null,"Peru",593.79603773584915,1173.7519,905.29150000000004,586.44259999999997]
["El Salvador","Saint Kitts and Nevis",472.65132124352402,1240.4880000000001,671.35590000000002,502.83659999999998]
["Guatemala","Saint Lucia",472.65132124352402,1240.4880000000001,671.35590000000002,502.83659999999998]
["Haiti","Saint Vincent and the Grenadines",472.65132124352402,1240.4880000000001,671.35590000000002,502.83659999999998]
["Honduras","Suriname",472.65132124352402,1240.4880000000001,671.35590000000002,502.83659999999998]
["Jamaica","Trinidad and Tobago",472.65132124352402,1240.4880000000001,789.54169999999999,676.07249999999999]
["Netherlands Antilles","Uruguay",574.09130434782617,1240.4880000000001,714.87819999999999,496]
["Nicaragua","Venezuela",472.65132124352402,1240.4880000000001,942.30510000000004,606.26649999999995]
["Panama","Non-OECD Americas",558.87739099499618,1191.9279468750001,730.28406250000012,511.61421562500016]
["Paraguay","Bahrain",852.140056482962,1144.2709,915.41219999999998,754.71889999999996]
["Peru","Iran",632.26499999999999,1144.2709,905.75850000000003,473.08449999999999]
["Trinidad and Tobago","Iraq",852.140056482962,1144.2709,1945.5879,330.7998]
["Uruguay","Jordan",583.86666666666667,1144.2709,670.17309999999998,499.36489999999998]
["Venezuela","Kuwait",780,1144.2709,842.09519999999998,573.92409999999995]
["Other Non-OECD Americas","Lebanon",650,1144.2709,864.34829999999999,547.42639999999994]
["Non-OECD Americas","Oman",852.140056482962,1144.2709,766.20500000000004,598.00850000000003]
["Bahrain","Qatar",852.140056482962,1144.2709,915.41219999999998,492.94900000000001]
["Islamic Rep. of Iran","Saudi Arabia",654,1144.2709,820.30669999999998,636.60609999999997]
["Iraq","Syria",852.140056482962,1144.2709,801.84029999999996,542.96730000000002]
["Jordan","United Arab Emirates",704.03333333333342,1144.2709,1195.7221999999999,588.90049999999997]
["Kuwait","Yemen",852.140056482962,1144.2709,700.92539999999997,551.48310000000004]
["Lebanon","Middle East",759.75044490814764,1144.2708999999998,945.31558333333317,549.1860916666667]
["Oman","European Union - 28",399.86670714285725,936.32006071428543,707.37341785714284,351.91298214285717]
["Qatar"]
["Saudi Arabia","Country Dataset Sources"]
[null,"Source: IGES List of Grid Emission Factor http://pub.iges.or.jp/modules/envirolib/view.php?docid=2136  "]
[null,"Purchase site: http://pub.iges.or.jp/index.html"]
[null,"Access date: 3/15/2016"]
[null,"IGES assembled average Clean Development Mechanism (CDM) combined marginal emission factors for grid electricity for a number of countries.  \n\n \nData used in precendence of IEA data. "]
[]
["Syrian Arab Republic ","Source: IEA CO2 Emissions From Fuel Combustion - Highlights 2013 http://www.iea.org/bookshop/669-CO2_Emissions_from_Fuel_Combustion  \n"]
["United Arab Emirates","Purchase site: http://www.iea.org/bookshop/"]
["Yemen","Access Date: 12/1/2015"]
["Middle East","CO2 data was obtained from IEA. Where country or regional marginal emission factors are not available from IGES, grid average emission factors can be found here. "]
["European Union - 27"]
[null,"Regional averages for fuel-specific emission factors were used where no data was available."]
[]
[null,"Note: The CLEER Protocol assumes that electricity generated from renewable sources have a default emission factor of zero gCO2/kWh.  This includes Solar Photovoltaic, Solar Thermal Power, Wind Turbine, Geothermal Power, and Hydroelectric Power."]

{"sheet":"LineLoss","index":14,"n_rows":209,"n_cols":6,"rows_kept":209,"cut":false,"hidden":true,"merged":[[201,1,206,2]]}
[]
[null,"IEA Electricity Information  - Lineloss",null,null,"Regional Averages"]
["IEA Names","Region/Country/Economy","Grid Average Lineloss",null,"Region","Grid Average Lineloss"]
["Canada","Afghanistan",5.7300046286854894E-2,null,"Africa",7.571494692664206E-2]
["Chile","Albania",0.10120170181363654,null,"Asia",5.7300046286854894E-2]
["Mexico","Algeria",9.4921608188063056E-2,null,"Europe",5.8109323007447068E-2]
["United States","Andorra",5.8109323007447068E-2,null,"North America",5.7679364750868239E-2]
["OECD Americas","Angola",7.4274443578152466E-2,null,"Oceania",5.2001785658027835E-2]
["Australia","Antigua and Barbuda",5.7679364750868239E-2,null,"South America",8.3808354719636283E-2]
["Israel","Argentina",8.483952739530716E-2]
["Japan","Armenia",8.1117836477101496E-2]
["Korea","Australia",5.1088307102519909E-2]
["New Zealand","Austria",4.4668720748035434E-2]
["OECD Asia Oceania","Azerbaijan",9.2191028899319433E-2]
["Austria","Bahamas, The",5.7679364750868239E-2]
["Belgium","Bahrain",5.6529996543816623E-2]
["Czech Republic","Bangladesh",7.5634750299117065E-2]
["Denmark","Barbados",5.7679364750868239E-2]
["Estonia","Belarus",7.3645600865716615E-2]
["Finland","Belgium",4.2668640828300589E-2]
["France","Belize",5.7679364750868239E-2]
["Germany","Benin",7.571494692664206E-2]
["Greece","Bhutan",5.7300046286854894E-2]
["Hungary","Bolivia",7.3745933119281321E-2]
["Iceland","Bosnia and Herzegovina",7.0304641404584214E-2]
["Ireland","Botswana",7.571494692664206E-2]
["Italy","Brazil",8.9500586040335006E-2]
["Luxembourg","Brunei Darussalam",6.0705841105028524E-2]
["Netherlands","Bulgaria",6.7275341301240382E-2]
["Norway","Burkina Faso",7.571494692664206E-2]
["Poland","Burma",0.10284541921067245]
["Portugal","Burundi",7.571494692664206E-2]
["Slovak Republic","Cambodia",0.10295623418100149]
["Slovenia","Cameroon",6.8913922466941349E-2]
["Spain","Canada",6.4650871431311707E-2]
["Sweden","Cape Verde",7.571494692664206E-2]
["Switzerland","Central African Republic",7.571494692664206E-2]
["Turkey","Chad",7.571494692664206E-2]
["United Kingdom","Chile",6.008554031852776E-2]
["OECD Europe","China",5.3072478000304985E-2]
["Albania","Colombia",8.2565240146690311E-2]
["Armenia","Comoros",7.571494692664206E-2]
["Azerbaijan","Congo",0.16409249290783473]
["Belarus","Congo, Democratic Republic",5.4988988608486125E-2]
["Bosnia and Herzegovina","Costa Rica",7.2176076836942007E-2]
["Bulgaria","Côte d'Ivoire",9.7900354249586069E-2]
["Croatia","Croatia",8.7756785661199613E-2]
["Cyprus","Cuba",8.7291441760489002E-2]
["Georgia","Cyprus",3.4014957464301235E-2]
["Gibraltar","Czech Republic",4.5793323849111701E-2]
["Kazakhstan","Denmark",5.5707210593762352E-2]
["Kosovo","Djibouti",7.571494692664206E-2]
["Kyrgyzstan","Dominica",5.7679364750868239E-2]
["Latvia","Dominican Republic",7.7815670694859229E-2]
["Lithuania","Ecuador",8.7447715846942081E-2]
["FYR of Macedonia","Egypt",7.0400638981562028E-2]
["Malta","El Salvador",7.4692994471491109E-2]
["Republic of Moldova","Equatorial Guinea",7.571494692664206E-2]
["Montenegro","Eritrea",8.320590989926839E-2]
["Romania","Estonia",6.1741215301746567E-2]
["Russian Federation","Ethiopia",9.0737612181809923E-2]
["Serbia","Fiji",5.2001785658027835E-2]
["Tajikistan","Finland",3.487435012324297E-2]
["Turkmenistan","France",5.5384649184760749E-2]
["Ukraine","Gabon",9.526458561652712E-2]
["Uzbekistan","Gambia, The",7.571494692664206E-2]
["Former Soviet Union (if no detail)","Georgia",7.321278244601806E-2]
["Former Yugoslavia (if no detail)","Germany",3.6652588492908249E-2]
["Non-OECD Europe and Eurasia","Ghana",0.10121890471249963]
["Algeria","Greece",4.727855578999432E-2]
["Angola","Grenada",5.7679364750868239E-2]
["Benin","Guatemala",8.2606532693671908E-2]
["Botswana","Guinea",7.571494692664206E-2]
["Cameroon","Guinea-Bissau",7.571494692664206E-2]
["Congo","Guyana",8.3808354719636283E-2]
["Dem. Rep. of Congo","Haiti",0.16997056886453349]
["Côte d'Ivoire","Holy See",5.8109323007447068E-2]
["Egypt","Honduras",0.10999961316374203]
["Eritrea","Hungary",7.2762088179621043E-2]
["Ethiopia","Iceland",2.8281817890827204E-2]
["Gabon","India",9.4936484643830046E-2]
["Ghana","Indonesia",6.7548430769630338E-2]
["Kenya","Iran",8.531177294768473E-2]
["Libya","Iraq",0.12766128361792253]
["Morocco","Ireland",5.9890561655961128E-2]
["Mozambique","Israel",2.9304993199727951E-2]
["Namibia","Italy",5.7985703238292274E-2]
["Nigeria","Jamaica",0.10257433755508308]
["Senegal","Japan",4.1804802630211163E-2]
["South Africa","Jordan",8.4241217866165952E-2]
["Sudan","Kazakhstan",6.441055862536349E-2]
["United Rep. of Tanzania","Kenya",9.0117373839958784E-2]
["Togo","Kiribati",5.2001785658027835E-2]
["Tunisia","Korea, North",8.7624497301248452E-2]
["Zambia","Korea, South",3.2314563389374634E-2]
["Zimbabwe","Kosovo",8.9069375133888309E-2]
["Other Africa","Kuwait",8.1267237119299576E-2]
["Africa","Kyrgyzstan",0.10150764628784838]
["Bangladesh","Laos",5.7300046286854894E-2]
["Brunei Darussalam","Latvia",7.2143457753547496E-2]
["Cambodia","Lebanon",7.4354580078326668E-2]
["Chinese Taipei","Lesotho",7.571494692664206E-2]
["India","Liberia",7.571494692664206E-2]
["Indonesia","Libya",9.4501315786315487E-2]
["DPR of Korea","Liechtenstein",5.8109323007447068E-2]
["Malaysia","Lithuania",8.6966897015945344E-2]
["Mongolia","Luxembourg",3.0645061061586217E-2]
["Myanmar","Macedonia, FYR",9.4054826014044579E-2]
["Nepal","Madagascar",7.571494692664206E-2]
["Pakistan","Malawi",7.571494692664206E-2]
["Philippines","Malaysia",5.5166139611296301E-2]
["Singapore","Maldives",5.7300046286854894E-2]
["Sri Lanka","Mali",7.571494692664206E-2]
["Thailand","Malta",7.5127864818267928E-2]
["Vietnam","Marshall Islands",5.2001785658027835E-2]
["Other Asia","Mauritania",7.571494692664206E-2]
["Asia","Mauritius",7.571494692664206E-2]
["People's Rep. of China","Mexico",8.6922303767348635E-2]
["Hong Kong, China","Micronesia, Federated States of",5.2001785658027835E-2]
["China","Moldova",0.10199026384034973]
["Argentina","Monaco",5.8109323007447068E-2]
[null,"Mongolia",8.2757554009730963E-2]
["Bolivia","Montenegro",9.8910719081152371E-2]
["Brazil","Morocco",8.1508808637105731E-2]
["Colombia","Mozambique",8.6519294893573948E-2]
["Costa Rica","Namibia",0.10446053736616828]
["Cuba","Nauru",5.2001785658027835E-2]
["Dominican Republic","Nepal",0.12083028942699647]
["Ecuador","Netherlands",3.7946664409079553E-2]
["El Salvador","New Zealand",5.7198995787467392E-2]
["Guatemala","Nicaragua",9.1213803073282473E-2]
["Haiti","Niger",7.571494692664206E-2]
["Honduras","Nigeria",7.5301373595601281E-2]
["Jamaica","Norway",5.714087819177658E-2]
["Netherlands Antilles","Oman",8.4378298802939206E-2]
["Nicaragua","Pakistan",9.0821453399386798E-2]
["Panama","Palau",5.2001785658027835E-2]
["Paraguay","Panama",8.340054595367366E-2]
["Peru","Papua New Guinea",5.2001785658027835E-2]
["Trinidad and Tobago","Paraguay",5.4041871098959984E-2]
["Uruguay","Peru",6.4456639702917901E-2]
["Venezuela","Philippines",7.5181041228041534E-2]
["Other Non-OECD Americas","Poland",5.8177484713456594E-2]
["Non-OECD Americas","Portugal",6.5132991732206935E-2]
["Bahrain","Qatar",5.4999577809971605E-2]
["Islamic Rep. of Iran","Romania",7.724103385949288E-2]
["Iraq","Russia",7.0715108357251089E-2]
[null,"Rwanda",7.571494692664206E-2]
[null,"Saint Kitts and Nevis",5.7679364750868239E-2]
[null,"Saint Lucia",5.7679364750868239E-2]
[null,"Saint Vincent and the Grenadines",5.7679364750868239E-2]
[null,"Samoa",5.2001785658027835E-2]
[null,"San Marino",5.8109323007447068E-2]
[null,"Sao Tome and Principe",7.571494692664206E-2]
[null,"Saudi Arabia",6.3908736846161052E-2]
[null,"Senegal",8.8533399421868941E-2]
[null,"Serbia",8.6227193943721442E-2]
[null,"Seychelles",7.571494692664206E-2]
[null,"Sierra Leone",7.571494692664206E-2]
[null,"Singapore",2.8070764025719307E-2]
[null,"Slovakia",2.8398567714420182E-2]
[null,"Slovenia",4.9546630344902906E-2]
[null,"Solomon Islands",5.2001785658027835E-2]
[null,"Somalia",7.571494692664206E-2]
[null,"South Africa",6.5632243029264389E-2]
[null,"South Sudan",5.0847457627118647E-2]
[null,"Spain",6.4954149822595675E-2]
[null,"Sri Lanka",8.0096018487556597E-2]
[null,"Sudan",0.22909373784519643]
[null,"Suriname",8.3808354719636283E-2]
[null,"Swaziland",7.571494692664206E-2]
[null,"Sweden",5.7607294381684979E-2]
[null,"Switzerland",5.6305117502635019E-2]
[null,"Syria",9.0559603936660571E-2]
[null,"Tajikistan",8.4144536558726835E-2]
[null,"Tanzania",0.10294208145456486]
[null,"Thailand",5.491050395418097E-2]
[null,"Timor-Leste",5.2001785658027835E-2]
[null,"Togo",7.571494692664206E-2]
[null,"Tonga",5.2001785658027835E-2]
[null,"Trinidad and Tobago",2.7960562547982112E-2]
[null,"Tunisia",8.293450109061215E-2]
[null,"Turkey",8.5460915686455904E-2]
[null,"Turkmenistan",8.1539771090360952E-2]
[null,"Tuvalu",5.2001785658027835E-2]
[null,"Uganda",7.571494692664206E-2]
[null,"Ukraine",7.4604627493893461E-2]
[null,"United Arab Emirates",5.8705113778070299E-2]
[null,"United Kingdom",5.9621438799079995E-2]
[null,"United States",5.427651723557974E-2]
[null,"Uruguay",7.7533378828687827E-2]
[null,"Uzbekistan",6.5292401988653451E-2]
[null,"Vanuatu",5.2001785658027835E-2]
[null,"Venezuela",9.9701240696059179E-2]
[null,"Vietnam",6.7640948579374208E-2]
[null,"Yemen",0.10900844576415189]
[null,"Zambia",8.6568386403383726E-2]
[null,"Zimbabwe",9.424919000184169E-2]
[]
[]
[null,"Country Dataset Sources"]
[null,"Source: IEA Electricity Information - adjusted Supply and Loss data\nAccess Date: 9/22/2015\n\nSource: IEA Electricity Information - adjusted Supply and Loss data for South Sudan and Sudan\nAccess Date: 3/23/2016"]
[]
[]
[]
[]
[]
[]
[null,"Regional averages for lineloss rates were used where no data was available."]

{"sheet":"Conversions","index":15,"n_rows":142,"n_cols":14,"rows_kept":142,"cut":false,"hidden":true,"merged":[]}
[]
[null,null,"IPCC SAR GWPs",null,null,null,"Additional Refrigerant GWPs",null,null,null,"IPCC AR4 GWPs"]
[null,null,"Gas","GWP",null,null,"Gas","GWP","Chemical Formula",null,"Gas","GWP"]
[null,null,"CO2",1,null,null,"HFC-41",150,"CH3F",null,"CO2",1]
[null,null,"CH4",21,null,null,"HFC-134",1000,"CHF2CHF2",null,"CH4",25]
[null,null,"N2O",310,null,null,"HFC-143",300,"CHF2CH2F",null,"N2O",298]
[null,null,"HFC-23",11700,null,null,"HFC-152",53,"CH2FCH2F",null,"HFC-23",14800]
[null,null,"HFC-32",650,null,null,"HFC-161",12,"CH3CH2F",null,"HFC-32",675]
[null,null,"HFC-125",2800,null,null,"HFC-236cb",1340,"CH2FCF2CF3",null,"HFC-125",3500]
[null,null,"HFC-134a",1300,null,null,"HFC-236ea",1370,"CHF2CHFCF3",null,"HFC-134a",1430]
[null,null,"HFC-143a",3800,null,null,"HFC-245ca",560,"CH2FCF2CHF2",null,"HFC-143a",4470]
[null,null,"HFC-152a",140,null,null,"HFC-245fa",1030,"CHF2CH2CF3",null,"HFC-152a",124]
[null,null,"HFC-227ea",2900,null,null,"HFC-365mfc",794,"CF3CH2CF2CH3",null,"HFC-227ea",3220]
[null,null,"HFC-236fa",6300,null,null,"PFC-218",7000,"C3F8 (CF3CF2CF3)",null,"HFC-236fa",9810]
[null,null,"HFC-4310mee",1300,null,null,"PFC-318 or PFC-c318",8700,"c-C4F8 ( -(CF2)4- )",null,"HFC-4310mee",1640]
[null,null,"CF4",6500,"PFC-14",null,"PFC-4-1-12",7500,"C5F12",null,"CF4",7390,"PFC-14"]
[null,null,"C2F6",9200,"PFC-116",null,"PFC-9-1-18",7500,"C10F18",null,"C2F6",12200,"PFC-116"]
[null,null,"C4F10",7000,"PFC-3-1-10",null,"Perfluorocyclopropane",17340,"c-C3F6",null,"C4F10",8860,"PFC-3-1-10"]
[null,null,"C6F14",7400,"PFC-5-1-14",null,null,null,null,null,"C6F14",9300,"PFC-5-1-14"]
[null,null,"SF6",23900,null,null,null,null,null,null,"SF6",22800]
[null,null,"Source: U.S. Inventory of Greenhouse Gas Emissions and Sinks 1990-2005 (Table ES-1), US EPA",null,null,null,"Source: EPA Mandatory Reporting Rule, Federal Register, Friday, October 30, 2009, Table A-1 to Subpart A of Part 98.",null,null,null,"Source: IPCC Fourth Assessment Report: Climate Change 2007, 2.10.2 Direct Global Warming Potentials"]
[null,null,"Available online at: http://www.epa.gov/climatechange/emissions/usgginv_archive.html",null,null,null,"Available online at: http://www.epa.gov/climatechange/emissions/downloads09/GHG-MRR-Full%20Version.pdf",null,null,null,"Avalilable online at: https://www.ipcc.ch/publications_and_data/ar4/wg1/en/ch2s2-10-2.html"]
[]
[null,null,"CO2/C",{"$f":"44/12","v":3.6666666666666665}]
[]
[]
[null,"Physical Conversions"]
[]
[null,"Area"]
[null,null,null,"sq. foot","sq. mile","sq. yard","sq. meter","sq. kilometer","acre","hectare"]
[null,1,"sq. foot",1,3.5870060000000002E-8,0.1111111,9.2903040000000006E-2,9.2903039999999994E-8,2.295675E-5,9.2903040000000008E-6]
[null,1,"sq. mile",27878400,1,3097600,2589988,2.589988,639.99739999999997,258.99880000000002]
[null,1,"sq. yard",9,3.2283059999999999E-7,1,0.83612739999999997,8.361274E-7,2.066107E-4,8.3612739999999996E-5]
[null,1,"sq. meter",10.763909999999999,3.8610219999999998E-7,1.1959900000000001,1,9.9999999999999995E-7,2.4710440000000003E-4,1E-4]
[null,1,"sq. kilometer",10763910,0.38610220000000001,1195990,1000000,1,247.1044,100]
[null,1,"acre",43560,1.5625000000000001E-3,4839.9629999999997,4046.8249999999998,4.0468589999999999E-3,1,0.4046863]
[null,1,"hectare",107639.1,3.861022E-3,11959.9,10000,0.01,2.471044,1]
[]
[null,"Distance"]
[null,null,null,"meter","kilometer","foot","yard","mile"]
[null,1,"meter",1,1E-3,3.2808299999999999,1.09361,6.2137119999999997E-4]
[null,1,"kilometer",1000,1,3280.83,1093.6130000000001,0.62137120000000001]
[null,1,"foot",0.30480000000000002,3.0480090000000002E-4,1,0.3333333,1.893939E-4]
[null,1,"yard",0.91439999999999999,9.1440279999999998E-4,3,1,5.6818180000000002E-4]
[null,1,"mile",1609.3440000000001,1.6093440000000001,5280,1760,1]
[]
[null,"Energy"]
[null,null,null,"watt-hour","kilowatt-hour","megawatt-hour","gigawatt-hour","joule","kilojoule","megajoule","gigajoule","BTU","MMBtu","therm"]
[null,1,"watt-hour",1,1E-3,9.9999999999999995E-7,1.0000000000000001E-9,3600,3.6,3.5999999999999999E-3,3.5999999999999998E-6,3.4121419999999998,3.4121419999999998E-6,3.412128E-5]
[null,1,"kilowatt-hour",1000,1,1E-3,9.9999999999999995E-7,3600000,3600,3.6,3.5999999999999999E-3,3412.1419999999998,3.412142E-3,3.4121279999999997E-2]
[null,1,"megawatt-hour",1000000,1000,1,1E-3,3600000000,3600000,3600,3.6,3412142,3.4121419999999998,34.121279999999999]
[null,1,"gigawatt-hour",1000000000,1000000,1000,1,3600000000000,3600000000,3600000,3600,3412142000,3412.1419999999998,34121.279999999999]
[null,1,"joule",2.777778E-4,2.777778E-7,2.7777780000000002E-10,2.777778E-13,1,1E-3,9.9999999999999995E-7,9.9999999999999986E-10,9.4781710000000003E-4,9.4781710000000005E-10,9.4781340000000003E-9]
[null,1,"kilojoule",0.27777780000000002,2.777778E-4,2.777778E-7,2.7777780000000002E-10,1000,1,1E-3,9.9999999999999995E-7,0.94781709999999997,9.4781709999999994E-7,9.4781339999999996E-6]
[null,1,"megajoule",277.77780000000001,0.27777780000000002,2.777778E-4,2.777778E-7,1000000,1000,1,1E-3,947.81709999999998,9.4781710000000003E-4,9.4781339999999992E-3]
[null,1,"gigajoule",277777.8,277.77780000000001,0.27777780000000002,2.777778E-4,1000000000,1000000,1000,1,947817.1,0.94781710000000008,9.4781339999999989]
[null,1,"BTU",0.29307109999999997,2.9307109999999998E-4,2.9307109999999998E-7,2.9307109999999999E-10,1055.056,1.055056,1.055056E-3,1.0550559999999999E-6,1,9.9999999999999995E-7,9.9999610000000008E-6]
[null,1,"MMBtu",293071.09999999998,293.0711,0.29307109999999997,2.9307109999999998E-4,1055056000,1055056,1055.056,1.055056,1000000,1,9.9999610000000008]
[null,1,"therm",29307.22,29.307220000000001,2.9307219999999998E-2,2.9307220000000001E-5,105506000,105506,105.506,0.105506,100000.4,0.10000039999999999,1]
[]
[null,"Flow"]
[null,null,null,"centimeter3/hour","foot3/hour","yard3/hour","meter3/hour","gallon/hour","liter/hour"]
[null,1,"centimeter3/hour",1,3.531467E-5,1.3079509999999999E-6,9.9999999999999995E-7,2.641721E-4,1E-3]
[null,1,"foot3/hour",28316.85,1,3.703704E-2,2.8316850000000001E-2,7.4805190000000001,28.316849999999999]
[null,1,"yard3/hour",764554.9,27,1,0.76455490000000004,201.97399999999999,764.55489999999998]
[null,1,"meter3/hour",1000000,35.31467,1.3079510000000001,1,264.1721,1000]
[null,1,"gallon/hour",3785.4119999999998,0.13368060000000001,4.9511319999999996E-3,3.7854120000000002E-3,1,3.785412]
[null,1,"liter/hour",1000,3.5314669999999999E-2,1.3079509999999999E-3,1E-3,0.26417210000000002,1]
[]
[null,"Light"]
[null,null,null,"Flame","Foot-Candles","Lux","Meter-Candles"]
[null,1,"Flame",1,4,43.055639999999997,43.055639999999997]
[null,1,"Foot-Candles",0.25,1,10.763909999999999,10.763909999999999]
[null,1,"Lux",2.3225760000000002E-2,9.2903040000000006E-2,1,1]
[null,1,"Meter-Candles",2.3225760000000002E-2,9.2903040000000006E-2,1,1]
[]
[null,"Mass"]
[null,null,null,"gram","kilogram","Megagram (tonne)","Gigagram","Teragram (MMT)","pound","short ton"]
[null,1,"gram",1,1E-3,{"$f":"10^-6","v":9.9999999999999995E-7},{"$f":"10^-9","v":1.0000000000000001E-9},{"$f":"10^-12","v":9.9999999999999998E-13},2.2046226218490001E-3,1.102311310924E-6]
[null,1,"kilogram",1000,1,1E-3,{"$f":"10^-6","v":9.9999999999999995E-7},{"$f":"10^-9","v":1.0000000000000001E-9},2.2046226218489999,{"$f":"J79*1000","v":1.102311310924E-3}]
[null,1,"Megagram (tonne)",1000000,1000,1,1E-3,{"$f":"10^-6","v":9.9999999999999995E-7},{"$f":"I80*D80","v":2204.6226218490001},{"$f":"J80*1000","v":1.1023113109239999}]
[null,1,"Gigagram",1000000000,1000000,1000,1,1E-3,{"$f":"I81*D80","v":2204622.621849},{"$f":"J81*1000","v":1102.3113109239998}]
[null,1,"Teragram (MMT)",1000000000000,1000000000,1000000,1000,1,{"$f":"I82*D80","v":2204622621.849},{"$f":"J82*1000","v":1102311.3109239999}]
[null,1,"pound",453.59237000000002,{"$f":"D84/1000","v":0.45359237000000002},4.5359237000000004E-4,4.5359237000000005E-7,4.5359237000000004E-10,1,{"$f":"1/2000","v":5.0000000000000001E-4}]
[null,1,"short ton",907184.74,907.18474000000003,0.90718474000000004,9.0718474000000009E-4,9.071847400000001E-7,2000,1]
[]
[null,"Power"]
[null,null,null,"watt","kilowatt","megawatt","BTU/hour"]
[null,1,"watt",1,1E-3,9.9999999999999995E-7,3.4151790000000002]
[null,1,"kilowatt",1000,1,1E-3,3415.1790000000001]
[null,1,"megawatt",1000000,1000,1,3415179]
[null,1,"BTU/hour",0.29281040000000003,2.9281039999999998E-4,2.9281040000000001E-7,1]
[]
[null,"Pressure"]
[null,null,null,"pascal","kilopascal","megapascal","pound/inch2","pound/foot2","millimeters of mercury"]
[null,1,"pascal",1,1E-3,9.9999999999999995E-7,1.4503770000000001E-4,2.088543E-2,7.5006170000000002E-3]
[null,1,"kilopascal",1000,1,1E-3,0.14503769999999999,20.885429999999999,7.5006170000000001]
[null,1,"megapascal",1000000,1000,1,145.0377,20885.43,7500.6170000000002]
[null,1,"pound/inch2",6894.7569999999996,6.8947570000000002,6.8947569999999996E-3,1,144,51.714930000000003]
[null,1,"pound/foot2",47.88026,4.7880260000000001E-2,4.788026E-5,6.9444440000000001E-3,1,0.35913149999999999]
[null,1,"millimeters of mercury",133.32239999999999,0.13332240000000001,1.3332240000000001E-4,1.933677E-2,2.7844959999999999,1]
[]
[null,"Speed"]
[null,null,null,"foot/hour","mile/hour","meter/hour","kilometer/hour"]
[null,1,"foot/hour",1,1.893939E-4,0.30480000000000002,3.0479999999999998E-4]
[null,1,"mile/hour",5280,1,1609.3440000000001,1.6093440000000001]
[null,1,"meter/hour",3.28084,6.2137119999999997E-4,1,1E-3]
[null,1,"kilometer/hour",3280.84,0.62137120000000001,1000,1]
[]
[null,"Temperature"]
[null,null,null,"Fahrenheit","Celsius"]
[null,1,"Fahrenheit",1,-17.22222]
[null,1,"Celsius",33.799999999999997,1]
[]
[null,"Time"]
[null,null,null,"second","minute","hour","day","week","month (30 days)","year"]
[null,1,"second",1,1.6666670000000001E-2,2.777778E-4,1.1574069999999999E-5,1.6534389999999999E-6,3.8580249999999999E-7,{"$f":"1/D123","v":3.1688087814028947E-8}]
[null,1,"minute",60,1,1.6666670000000001E-2,6.9444440000000004E-4,9.9206349999999996E-5,2.314815E-5,{"$f":"1/E123","v":1.9012852688417369E-6}]
[null,1,"hour",3600,60,1,4.1666670000000003E-2,5.9523809999999996E-3,1.3888889999999999E-3,{"$f":"1/F123","v":1.1407711613050422E-4}]
[null,1,"day",86400,1440,24,1,0.14285709999999999,3.3333330000000001E-2,{"$f":"1/G123","v":2.7378507871321013E-3}]
[null,1,"week",604800,10080,168,7,1,0.23333329999999999,{"$f":"1/H123","v":1.9164955509924708E-2}]
[null,1,"month (30 days)",2592000,43200,720,30,4.2857139999999996,1,{"$f":"1/I123","v":8.2135523613963035E-2}]
[null,1,"year",{"$f":"E123*D118","v":31557600},{"$f":"F123*E119","v":525960},{"$f":"G123*F120","v":8766},365.25,{"$f":"G123/G121","v":52.178571428571431},{"$f":"G123/G122","v":12.175000000000001},1]
[]
[null,"Volume"]
[null,null,null,"liter","gallon","quart","cubic inch","cubic foot","thousand cubic feet (MCF)","million cubic feet (MMCF)","cubic yard","cubic meter"]
[null,1,"liter",1,0.26417210000000002,1.0566880000000001,61.023739999999997,3.5314669999999999E-2,3.531467E-5,3.5314669999999996E-8,1.3079509999999999E-3,1E-3]
[null,1,"gallon",3.785412,1,4,231,0.13368060000000001,1.3368060000000002E-4,1.3368060000000002E-7,4.9511319999999996E-3,3.7854120000000002E-3]
[null,1,"quart",0.94635290000000005,0.25,1,57.75,3.3420140000000001E-2,3.3420139999999998E-5,3.3420140000000002E-8,1.2377829999999999E-3,9.463529E-4]
[null,1,"cubic inch",1.6387059999999998E-2,4.329004E-3,1.7316020000000001E-2,1,5.7870369999999999E-4,5.7870369999999994E-7,5.7870370000000002E-10,2.1433469999999999E-5,1.6387060000000002E-5]
[null,1,"cubic foot",28.316849999999999,7.4805190000000001,29.922080000000001,1728,1,1E-3,9.9999999999999995E-7,3.703704E-2,2.8316850000000001E-2]
[null,1,"thousand cubic feet (MCF)",28316.85,7480.5190000000002,29922.080000000002,1728000,1000,1,1E-3,37.037039999999998,28.316850000000002]
[null,1,"million cubic feet (MMCF)",28316850,7480519,29922080,1728000000,1000000,1000,1,37037.040000000001,28316.850000000002]
[null,1,"cubic yard",764.55489999999998,201.97399999999999,807.89610000000005,46656,27,2.7E-2,2.6999999999999999E-5,1,0.76455490000000004]
[null,1,"cubic meter",1000,264.1721,1056.6880000000001,61023.74,35.31467,3.5314669999999999E-2,3.531467E-5,1.3079510000000001,1]
[null,1,"petroleum barrel",{"$f":"E136*D128","v":158.98730399999999},42,{"$f":"$E$136*F128","v":168},{"$f":"$E$136*G128","v":9702},{"$f":"$E$136*H128","v":5.6145852000000005},5.6145852000000001E-3,5.6145852000000001E-6,{"$f":"$E$136*K128","v":0.20794754399999998},{"$f":"$E$136*L128","v":0.158987304}]
[]
[]
[]
[null,"Wood Conversions"]
[null,null,1.25,"short ton/cord","EIA, Annual Energy Review 2007, Table B3"]
[null,null,0.8,"cords per ton","EIA, Annual Energy Review 2007, Table B3"]

{"sheet":"Pick Lists","index":16,"n_rows":213,"n_cols":5,"rows_kept":213,"cut":false,"hidden":true,"merged":[]}
[]
[]
[null,"Pick Lists"]
[null,"Status List"]
[null,"Draft"]
[null,"In Review"]
[null,"Edits Required"]
[null,"Completed"]
[]
[null,"Grid Electricity"]
[null,"Grid (Average Mix)"]
[null,"Grid (Coal/Peat)"]
[null,"Grid (Oil)"]
[null,"Grid (Natural Gas)"]
[]
[null,"Fuel Units of Measure"]
[null,"Gigajoules (GJ)"]
[null,"Tonnes (t)"]
[null,"Gallons (gal)"]
[null,"Liters (L)"]
[null,"Pounds (lbs.)"]
[null,"Kilograms (kg)"]
[null,"Million BTUs (MMBTU)"]
[null,"Therms "]
[]
[null,"Alternate Fuels List"]
[null,"Gigajoules (GJ)"]
[null,"Tonnes (t)"]
[null,"Pounds (lbs.)"]
[null,"Kilograms (kg)"]
[null,"Million BTUs (MMBTU)"]
[null,"Therms "]
[]
[null,"Renewables Electricity Generation List","Technology Years","Annual Degradation Rate"]
[null,"Solar Photovoltaic",{"$f":"C205","v":25},{"$f":"D205","v":5.0000000000000001E-3}]
[null,"Wind Turbine",{"$f":"C207","v":25},{"$f":"D207","v":0.01}]
[null,"Geothermal Power ",{"$f":"C209","v":30},{"$f":"D209","v":0.01}]
[null,"Hydroelectric Power",{"$f":"C208","v":40},{"$f":"D208","v":3.0000000000000001E-3}]
[]
[]
[]
[]
[null,"Yes"]
[null,"No"]
[]
[]
[null,1]
[null,2]
[null,3]
[null,4]
[]
[null,"Grid Electricity"]
[null,"On-Site Combustion"]
[]
[]
[null,"Electricity"]
[null,"Diesel"]
[null,"kWh"]
[null,"MWh"]
[]
[]
[null,"Renewable Electricity Generation"]
[null,"Fuel Switching"]
[null,"Energy Efficiency"]
[]
[]
[null,"Utility Grid Connected","->average mix, no line loss"]
[null,"Distributed/Micro Grid Connected","-> average mix, with line loss"]
[null,"Off-Grid","-> diesel or average grid with line loss"]
[]
[]
[null,"Combined Marginal Grid","Average Grid Mix"]
[null,"Coal/Peat"]
[null,"Oil"]
[null,"Natural Gas"]
[]
[]
[null,"Average Grid Mix"]
[null,"Diesel Generator"]
[]
[]
[]
[null,"New Fuel List","[Do not remove blank rows]"]
[]
[null,"Grid Electricity"]
[]
[null,"Charcoal","Biomass - Charcoal"]
[null,"Coal - Bituminous","Coal - Bituminous"]
[null,"Diesel","Oil - Gas/Diesel"]
[null,"Fuel Oil (Residual)","Oil - Residual Fuel"]
[null,"Kerosene","Kerosene - Other"]
[null,"Motor Gasoline (Petrol)","Gasoline - Motor"]
[null,"Natural Gas","Natural Gas"]
[null,"Wood and Wood Waste","Biomass - Wood / Wood Waste"]
[]
[null,"--Crude Oil and Petroleum Products--"]
[null,"Aviation Gasoline ","Gasoline - Aviation"]
[null,"Bitumen","Bitumen"]
[null,"Crude Oil","Oil - Crude"]
[null,"Ethane","Ethane"]
[null,"Jet Gasoline","Gasoline - Jet"]
[null,"Jet Kerosene","Kerosene - Jet"]
[null,"Liquefied Petroleum Gases (LPGs)","Liquefied Petroleum Gases"]
[null,"Lubricants","Lubricants"]
[null,"Naphtha","Naphtha"]
[null,"Natural Gas Liquids","Natural Gas Liquids"]
[null,"Orimulsion","Orimulsion"]
[null,"Other Petroleum Products","Oil - Other Petroleum"]
[null,"Petroleum Coke","Petroleum Coke"]
[null,"Refinery Feedstocks","Refinery Feedstocks"]
[null,"Refinery Gas","Oil - Refinery Gas"]
[null,"Shale Oil","Oil - Shale"]
[null,"Waxes","Oil - Paraffin Waxes"]
[null,"White Spirit and SBP","Oil - White Spirit and SBP"]
[]
[null,"--Coal and Coal Products--"]
[null,"Anthracite","Coal - Anthracite"]
[null,"Blast Furnace Gas","Blast Furnace Gas"]
[null,"Brown Coal Briquettes","Brown Coal Briquettes"]
[null,"Coal Tar","Coal Tar"]
[null,"Coke Oven Coke and Lignite Coke","Coke - Coke Oven and Lignite"]
[null,"Coke Oven Gas","Coke Oven Gas"]
[null,"Coking Coal","Coal - Coking Coal"]
[null,"Gas Coke","Coke - Gas"]
[null,"Gas Works Gas","Gas Works Gas"]
[null,"Lignite","Coal - Lignite"]
[null,"Oil Shale and Tar Sands","Oil Shale and Tar Sands"]
[null,"Oxygen Steel Furnace Gas","Oxygen Steel Furnace Gas"]
[null,"Patent Fuel","Patent Fuel"]
[null,"Sub-Bituminous Coal","Coal - Sub-Bituminous"]
[]
[null,"--Biomass--"]
[null,"Biodiesels","Biofuel - Biodiesels"]
[null,"Biogasoline","Biofuel - Biogasoline"]
[null,"Landfill Gas","Biogas - Landfill Gas"]
[null,"Municipal Wastes (biomass fraction)","Municipal Wastes (biomass fraction)"]
[null,"Other Biogas","Biogas - Other Biogas"]
[null,"Other Liquid Biofuels","Biofuel - Other Liquid Biofuels"]
[null,"Other Primary Solid Biomass","Biomass - Other Primary Solid"]
[null,"Sludge Gas","Biogas - Sludge Gas"]
[null,"Sulphite Lyes (Black Liquor)","Biomass - Sulphite lyes (Black Liquor)"]
[]
[null,"--Other--"]
[null,"Industrial Wastes","Industrial Wastes"]
[null,"Municipal Wastes (nonbiomass fraction)","Municipal Wastes (nonbiomass fraction)"]
[null,"Peat","Peat"]
[null,"Waste Oils","Waste Oils"]
[]
[null,"Fiscal Years","Installation Years"]
[null,"FY2030",{"$f":"IF(AND(RIGHT('Data Input'!$F$17,4)>=RIGHT('Pick Lists'!B150,4),(RIGHT('Data Input'!$F$17,4)-RIGHT('Pick Lists'!B150,4))<25),'Pick Lists'!B150,\"\")","v":{"$error":"#VALUE!"}}]
[null,"FY2029",{"$f":"IF(AND(RIGHT('Data Input'!$F$17,4)>=RIGHT('Pick Lists'!B151,4),(RIGHT('Data Input'!$F$17,4)-RIGHT('Pick Lists'!B151,4))<25),'Pick Lists'!B151,\"\")","v":{"$error":"#VALUE!"}}]
[null,"FY2028",{"$f":"IF(AND(RIGHT('Data Input'!$F$17,4)>=RIGHT('Pick Lists'!B152,4),(RIGHT('Data Input'!$F$17,4)-RIGHT('Pick Lists'!B152,4))<25),'Pick Lists'!B152,\"\")","v":{"$error":"#VALUE!"}}]
[null,"FY2027",{"$f":"IF(AND(RIGHT('Data Input'!$F$17,4)>=RIGHT('Pick Lists'!B153,4),(RIGHT('Data Input'!$F$17,4)-RIGHT('Pick Lists'!B153,4))<25),'Pick Lists'!B153,\"\")","v":{"$error":"#VALUE!"}}]
[null,"FY2026",{"$f":"IF(AND(RIGHT('Data Input'!$F$17,4)>=RIGHT('Pick Lists'!B154,4),(RIGHT('Data Input'!$F$17,4)-RIGHT('Pick Lists'!B154,4))<25),'Pick Lists'!B154,\"\")","v":{"$error":"#VALUE!"}}]
[null,"FY2025",{"$f":"IF(AND(RIGHT('Data Input'!$F$17,4)>=RIGHT('Pick Lists'!B155,4),(RIGHT('Data Input'!$F$17,4)-RIGHT('Pick Lists'!B155,4))<25),'Pick Lists'!B155,\"\")","v":{"$error":"#VALUE!"}}]
[null,"FY2024",{"$f":"IF(AND(RIGHT('Data Input'!$F$17,4)>=RIGHT('Pick Lists'!B156,4),(RIGHT('Data Input'!$F$17,4)-RIGHT('Pick Lists'!B156,4))<25),'Pick Lists'!B156,\"\")","v":{"$error":"#VALUE!"}}]
[null,"FY2023",{"$f":"IF(AND(RIGHT('Data Input'!$F$17,4)>=RIGHT('Pick Lists'!B157,4),(RIGHT('Data Input'!$F$17,4)-RIGHT('Pick Lists'!B157,4))<25),'Pick Lists'!B157,\"\")","v":{"$error":"#VALUE!"}}]
[null,"FY2022",{"$f":"IF(AND(RIGHT('Data Input'!$F$17,4)>=RIGHT('Pick Lists'!B158,4),(RIGHT('Data Input'!$F$17,4)-RIGHT('Pick Lists'!B158,4))<25),'Pick Lists'!B158,\"\")","v":{"$error":"#VALUE!"}}]
[null,"FY2021",{"$f":"IF(AND(RIGHT('Data Input'!$F$17,4)>=RIGHT('Pick Lists'!B159,4),(RIGHT('Data Input'!$F$17,4)-RIGHT('Pick Lists'!B159,4))<25),'Pick Lists'!B159,\"\")","v":{"$error":"#VALUE!"}}]
[null,"FY2020",{"$f":"IF(AND(RIGHT('Data Input'!$F$17,4)>=RIGHT('Pick Lists'!B160,4),(RIGHT('Data Input'!$F$17,4)-RIGHT('Pick Lists'!B160,4))<25),'Pick Lists'!B160,\"\")","v":{"$error":"#VALUE!"}}]
[null,"FY2019",{"$f":"IF(AND(RIGHT('Data Input'!$F$17,4)>=RIGHT('Pick Lists'!B161,4),(RIGHT('Data Input'!$F$17,4)-RIGHT('Pick Lists'!B161,4))<25),'Pick Lists'!B161,\"\")","v":{"$error":"#VALUE!"}}]
[null,"FY2018",{"$f":"IF(AND(RIGHT('Data Input'!$F$17,4)>=RIGHT('Pick Lists'!B162,4),(RIGHT('Data Input'!$F$17,4)-RIGHT('Pick Lists'!B162,4))<25),'Pick Lists'!B162,\"\")","v":{"$error":"#VALUE!"}}]
[null,"FY2017",{"$f":"IF(AND(RIGHT('Data Input'!$F$17,4)>=RIGHT('Pick Lists'!B163,4),(RIGHT('Data Input'!$F$17,4)-RIGHT('Pick Lists'!B163,4))<25),'Pick Lists'!B163,\"\")","v":{"$error":"#VALUE!"}}]
[null,"FY2016",{"$f":"IF(AND(RIGHT('Data Input'!$F$17,4)>=RIGHT('Pick Lists'!B164,4),(RIGHT('Data Input'!$F$17,4)-RIGHT('Pick Lists'!B164,4))<25),'Pick Lists'!B164,\"\")","v":{"$error":"#VALUE!"}}]
[null,"FY2015",{"$f":"IF(AND(RIGHT('Data Input'!$F$17,4)>=RIGHT('Pick Lists'!B165,4),(RIGHT('Data Input'!$F$17,4)-RIGHT('Pick Lists'!B165,4))<25),'Pick Lists'!B165,\"\")","v":{"$error":"#VALUE!"}}]
[null,"FY2014",{"$f":"IF(AND(RIGHT('Data Input'!$F$17,4)>=RIGHT('Pick Lists'!B166,4),(RIGHT('Data Input'!$F$17,4)-RIGHT('Pick Lists'!B166,4))<25),'Pick Lists'!B166,\"\")","v":{"$error":"#VALUE!"}}]
[null,"FY2013",{"$f":"IF(AND(RIGHT('Data Input'!$F$17,4)>=RIGHT('Pick Lists'!B167,4),(RIGHT('Data Input'!$F$17,4)-RIGHT('Pick Lists'!B167,4))<25),'Pick Lists'!B167,\"\")","v":{"$error":"#VALUE!"}}]
[null,"FY2012",{"$f":"IF(AND(RIGHT('Data Input'!$F$17,4)>=RIGHT('Pick Lists'!B168,4),(RIGHT('Data Input'!$F$17,4)-RIGHT('Pick Lists'!B168,4))<25),'Pick Lists'!B168,\"\")","v":{"$error":"#VALUE!"}}]
[null,"FY2011",{"$f":"IF(AND(RIGHT('Data Input'!$F$17,4)>=RIGHT('Pick Lists'!B169,4),(RIGHT('Data Input'!$F$17,4)-RIGHT('Pick Lists'!B169,4))<25),'Pick Lists'!B169,\"\")","v":{"$error":"#VALUE!"}}]
[null,"FY2010",{"$f":"IF(AND(RIGHT('Data Input'!$F$17,4)>=RIGHT('Pick Lists'!B170,4),(RIGHT('Data Input'!$F$17,4)-RIGHT('Pick Lists'!B170,4))<25),'Pick Lists'!B170,\"\")","v":{"$error":"#VALUE!"}}]
[null,"FY2009",{"$f":"IF(AND(RIGHT('Data Input'!$F$17,4)>=RIGHT('Pick Lists'!B171,4),(RIGHT('Data Input'!$F$17,4)-RIGHT('Pick Lists'!B171,4))<25),'Pick Lists'!B171,\"\")","v":{"$error":"#VALUE!"}}]
[null,"FY2008",{"$f":"IF(AND(RIGHT('Data Input'!$F$17,4)>=RIGHT('Pick Lists'!B172,4),(RIGHT('Data Input'!$F$17,4)-RIGHT('Pick Lists'!B172,4))<25),'Pick Lists'!B172,\"\")","v":{"$error":"#VALUE!"}}]
[null,"FY2007",{"$f":"IF(AND(RIGHT('Data Input'!$F$17,4)>=RIGHT('Pick Lists'!B173,4),(RIGHT('Data Input'!$F$17,4)-RIGHT('Pick Lists'!B173,4))<25),'Pick Lists'!B173,\"\")","v":{"$error":"#VALUE!"}}]
[null,"FY2006",{"$f":"IF(AND(RIGHT('Data Input'!$F$17,4)>=RIGHT('Pick Lists'!B174,4),(RIGHT('Data Input'!$F$17,4)-RIGHT('Pick Lists'!B174,4))<25),'Pick Lists'!B174,\"\")","v":{"$error":"#VALUE!"}}]
[null,"FY2005",{"$f":"IF(AND(RIGHT('Data Input'!$F$17,4)>=RIGHT('Pick Lists'!B175,4),(RIGHT('Data Input'!$F$17,4)-RIGHT('Pick Lists'!B175,4))<25),'Pick Lists'!B175,\"\")","v":{"$error":"#VALUE!"}}]
[null,"FY2004",{"$f":"IF(AND(RIGHT('Data Input'!$F$17,4)>=RIGHT('Pick Lists'!B176,4),(RIGHT('Data Input'!$F$17,4)-RIGHT('Pick Lists'!B176,4))<25),'Pick Lists'!B176,\"\")","v":{"$error":"#VALUE!"}}]
[null,"FY2003",{"$f":"IF(AND(RIGHT('Data Input'!$F$17,4)>=RIGHT('Pick Lists'!B177,4),(RIGHT('Data Input'!$F$17,4)-RIGHT('Pick Lists'!B177,4))<25),'Pick Lists'!B177,\"\")","v":{"$error":"#VALUE!"}}]
[null,"FY2002",{"$f":"IF(AND(RIGHT('Data Input'!$F$17,4)>=RIGHT('Pick Lists'!B178,4),(RIGHT('Data Input'!$F$17,4)-RIGHT('Pick Lists'!B178,4))<25),'Pick Lists'!B178,\"\")","v":{"$error":"#VALUE!"}}]
[null,"FY2001",{"$f":"IF(AND(RIGHT('Data Input'!$F$17,4)>=RIGHT('Pick Lists'!B179,4),(RIGHT('Data Input'!$F$17,4)-RIGHT('Pick Lists'!B179,4))<25),'Pick Lists'!B179,\"\")","v":{"$error":"#VALUE!"}}]
[null,"FY2000",{"$f":"IF(AND(RIGHT('Data Input'!$F$17,4)>=RIGHT('Pick Lists'!B180,4),(RIGHT('Data Input'!$F$17,4)-RIGHT('Pick Lists'!B180,4))<25),'Pick Lists'!B180,\"\")","v":{"$error":"#VALUE!"}}]
[null,"FY1999",{"$f":"IF(AND(RIGHT('Data Input'!$F$17,4)>=RIGHT('Pick Lists'!B181,4),(RIGHT('Data Input'!$F$17,4)-RIGHT('Pick Lists'!B181,4))<25),'Pick Lists'!B181,\"\")","v":{"$error":"#VALUE!"}}]
[null,"FY1998",{"$f":"IF(AND(RIGHT('Data Input'!$F$17,4)>=RIGHT('Pick Lists'!B182,4),(RIGHT('Data Input'!$F$17,4)-RIGHT('Pick Lists'!B182,4))<25),'Pick Lists'!B182,\"\")","v":{"$error":"#VALUE!"}}]
[null,"FY1997",{"$f":"IF(AND(RIGHT('Data Input'!$F$17,4)>=RIGHT('Pick Lists'!B183,4),(RIGHT('Data Input'!$F$17,4)-RIGHT('Pick Lists'!B183,4))<25),'Pick Lists'!B183,\"\")","v":{"$error":"#VALUE!"}}]
[null,"FY1996",{"$f":"IF(AND(RIGHT('Data Input'!$F$17,4)>=RIGHT('Pick Lists'!B184,4),(RIGHT('Data Input'!$F$17,4)-RIGHT('Pick Lists'!B184,4))<25),'Pick Lists'!B184,\"\")","v":{"$error":"#VALUE!"}}]
[null,"FY1995",{"$f":"IF(AND(RIGHT('Data Input'!$F$17,4)>=RIGHT('Pick Lists'!B185,4),(RIGHT('Data Input'!$F$17,4)-RIGHT('Pick Lists'!B185,4))<25),'Pick Lists'!B185,\"\")","v":{"$error":"#VALUE!"}}]
[null,"FY1994",{"$f":"IF(AND(RIGHT('Data Input'!$F$17,4)>=RIGHT('Pick Lists'!B186,4),(RIGHT('Data Input'!$F$17,4)-RIGHT('Pick Lists'!B186,4))<25),'Pick Lists'!B186,\"\")","v":{"$error":"#VALUE!"}}]
[null,"FY1993",{"$f":"IF(AND(RIGHT('Data Input'!$F$17,4)>=RIGHT('Pick Lists'!B187,4),(RIGHT('Data Input'!$F$17,4)-RIGHT('Pick Lists'!B187,4))<25),'Pick Lists'!B187,\"\")","v":{"$error":"#VALUE!"}}]
[null,"FY1992",{"$f":"IF(AND(RIGHT('Data Input'!$F$17,4)>=RIGHT('Pick Lists'!B188,4),(RIGHT('Data Input'!$F$17,4)-RIGHT('Pick Lists'!B188,4))<25),'Pick Lists'!B188,\"\")","v":{"$error":"#VALUE!"}}]
[null,"FY1991",{"$f":"IF(AND(RIGHT('Data Input'!$F$17,4)>=RIGHT('Pick Lists'!B189,4),(RIGHT('Data Input'!$F$17,4)-RIGHT('Pick Lists'!B189,4))<25),'Pick Lists'!B189,\"\")","v":{"$error":"#VALUE!"}}]
[null,"FY1990",{"$f":"IF(AND(RIGHT('Data Input'!$F$17,4)>=RIGHT('Pick Lists'!B190,4),(RIGHT('Data Input'!$F$17,4)-RIGHT('Pick Lists'!B190,4))<25),'Pick Lists'!B190,\"\")","v":{"$error":"#VALUE!"}}]
[]
[]
[null,"Energy in absence of activity"]
[null,"Percent energy savings of activity"]
[]
[]
[null,"Navigation Conditions!"]
[null,"Activity Details Sections Check",null,{"$f":"IF(OR('Data Input'!F14=\"\",'Data Input'!F15=\"\",'Data Input'!F16=\"\",'Data Input'!F17=\"\",CountryInput=\"\"),FALSE,TRUE)","v":false}]
[null,"Data Inputs",null,{"$f":"COUNTIF('Data Input'!L38:N47,\" - \")=0","v":true}]
[null,"Final Condition",null,{"$f":"AND(D198,D199)","v":false}]
[]
[]
[]
[null,"Technology ","Estimated Asset Lifetime (Years)","Annual Degradation Rate","Lead"]
[null,"Solar PV",25,5.0000000000000001E-3,"Craig Schultz"]
[null,"Solar Thermal",30,3.0000000000000001E-3,"Martin Anderson"]
[null,"Wind",25,0.01,"Ellen Allman"]
[null,"Hydroelectric",40,3.0000000000000001E-3,"Martin Anderson"]
[null,"Geothermal- power",30,0.01,"Ellen Allman"]
[null,"Geothermal- direct heat",30,5.0000000000000001E-3,"Ellen Allman"]
[null,"Geothermal - heat pumps",20,4.0000000000000001E-3,"Ellen Allman"]
[null,"Energy Efficiency",15,5.0000000000000001E-3]
[null,"Fuel Switching",15,5.0000000000000001E-3]